Peptide,PTM,ModifiedAA,ModifiedPosition,PeptideUniqueToGene,ExperimentDesc,ExpID,PubmedID,ScoreType,IdentScore,LocProb,Log2FChange,PQ-val,QuantSig,PEP,MassErrorPPM
SETNTTDAKTVPAEAEK,ub,K,10,true,"upl3 mutant / wildtype",168,35926874,"MaxQuant score",82.6630000,1.0000000,0.5280712,0.4967600,NO,1.1086000085925E-5,0.4162700
STVVSLIER,ph,T,408,false,"Lateral root-induction - NAA vs control",106,23328941,"MASCOT Score",21.0000000,,,,,,
GVQLSGGQKQR,ac,K,509,false,"Quantitative Acetylproteomics",101,29440448,,,,,,,,
SGAYASLIR,ph,S,592,true,"atm and atr DNA damage response",88,25561503,"MASCOT Score",52.0000000,1.0000000,,,,,-0.4600000
SGAYASLIR,ph,S,592,true,"Tissue atlas Arabidopsis - ProteomicsDB",114,32188942,"MaxQuant score",123.9600000,1.0000000,,,,0.00022577999334317,
DFSNPSTR,ph,S,611,true,"atm and atr DNA damage response",88,25561503,"MASCOT Score",36.0000000,0.9460000,,,,,0.1000000
DFSNPSTR,ph,S,611,true,"Tissue atlas Arabidopsis - ProteomicsDB",114,32188942,"MaxQuant score",88.6810000,0.9999280,,,,0.0070983897894621,
DFSNPSTRR,ph,S,614,true,"Tissue atlas Arabidopsis - ProteomicsDB",114,32188942,"MaxQuant score",148.2800000,0.8837080,,,,6.3517596572638E-5,
DFSNPSTR,ph,S,614,true,"STN8 phosphoproteome",38,21768351,"MASCOT Score",37.7900000,,,,,,-1.8492500
DFSNPSTR,ph,S,614,true,"atm and atr DNA damage response",88,25561503,"MASCOT Score",33.0000000,0.9430000,,,,,0.5300000
DFSNPSTR,ph,S,614,true,"TOR Kinase and ABA Receptor",100,29290610,XCorr,2.6537671,0.9355000,,,,0.0011569999624044,
STRLSHSLSTK,ph,S,620,true,"atm and atr DNA damage response",88,25561503,"MASCOT Score",23.0000000,0.9910000,,,,,0.2400000
STRLSHSLSTK,ph,S,620,true,"Tissue atlas Arabidopsis - ProteomicsDB",114,32188942,"MaxQuant score",130.4700000,0.9517040,,,,6.436449893954E-6,
STRLSHSLSTK,ph,S,624,true,"atm and atr DNA damage response",88,25561503,"MASCOT Score",23.0000000,0.9910000,,,,,0.2400000
STRLSHSLSTK,ph,S,624,true,"Tissue atlas Arabidopsis - ProteomicsDB",114,32188942,"MaxQuant score",130.4700000,0.9996790,,,,6.436449893954E-6,
LSHSLSTK,ph,S,626,true,"Tissue atlas Arabidopsis - ProteomicsDB",114,32188942,"MaxQuant score",131.4500000,0.9992140,,,,0.0026570800691843,
LSHSLSTKSLSLR,ph,S,628,true,"atm and atr DNA damage response",88,25561503,"MASCOT Score",49.0000000,0.9190000,,,,,-1.0800000
STRLSHSLSTK,ph,S,628,true,"atm and atr DNA damage response",88,25561503,"MASCOT Score",23.0000000,0.9910000,,,,,0.2400000
LSHSLSTK,ph,S,628,true,"Chloroplast kinase substrates",60,19376835,"MASCOT Score",33.7600000,,,,,,-1.4739900
LSHSLSTK,ph,S,628,true,"atm and atr DNA damage response",88,25561503,"MASCOT Score",41.0000000,0.9290000,,,,,1.3900000
LSHSLSTK,ph,S,628,true,"Tissue atlas Arabidopsis - ProteomicsDB",114,32188942,"MaxQuant score",197.2100000,0.9994670,,,,3.0489299973624E-9,
LSHSLSTKSLSLR,ph,S,631,true,"atm and atr DNA damage response",88,25561503,"MASCOT Score",49.0000000,0.9990000,,,,,-1.0800000
LSHSLSTKSLSLR,ph,S,631,true,"Tissue atlas Arabidopsis - ProteomicsDB",114,32188942,"MaxQuant score",101.0800000,0.9473770,,,,8.9870598458219E-5,
LSHSLSTKSLSLR,ph,S,633,true,"atm and atr DNA damage response",88,25561503,"MASCOT Score",30.0000000,1.0000000,,,,,0.1000000
NLSYSYSTGADGR,ph,S,643,true,"atm and atr DNA damage response",88,25561503,"MASCOT Score",68.0000000,0.8870000,,,,,-0.1200000
NLSYSYSTGADGR,ph,S,643,true,"Tissue atlas Arabidopsis - ProteomicsDB",114,32188942,"MaxQuant score",215.4800000,1.0000000,,,,0,
NLSYSYSTGADGR,ph,S,645,true,"srk2dei ABA signaling phopshoproteomics",83,23572148,"MASCOT Score",27.0000000,,,,,,-0.0004000
NLSYSYSTGADGR,ph,S,645,true,"atm and atr DNA damage response",88,25561503,"MASCOT Score",40.0000000,0.8740000,,,,,0.5900000
NLSYSYSTGADGR,ph,S,645,true,"Tissue atlas Arabidopsis - ProteomicsDB",114,32188942,"MaxQuant score",199.1300000,0.9690720,,,,6.5708700107858E-31,
NLSYSYSTGADGR,ph,Y,646,true,"Large-scale phosphorylation discovery",44,23111157,XCorr,2.7940000,,,,,,
NLSYSYSTGADGR,ph,Y,646,true,"srk2dei ABA signaling phopshoproteomics",83,23572148,"MASCOT Score",48.0000000,,,,,,0.0002000
NLSYSYSTGADGR,ph,Y,646,true,"LAXIC - ABA stress",84a,23660473,XCorr,3.7500000,0.9190000,,,,0.0011894500348717,
NLSYSYSTGADGR,ph,Y,646,true,"SnRK2 protein kinase substrates",85,23776212,XCorr,2.8951690,0.9190000,,,,0.0041333897970617,
NLSYSYSTGADGR,ph,S,647,true,"Chloroplast kinase substrates",60,19376835,"MASCOT Score",36.7800000,,,,,,-0.3787600
NLSYSYSTGADGR,ph,S,647,true,"srk2dei ABA signaling phopshoproteomics",83,23572148,"MASCOT Score",64.0000000,,,,,,0.0002000
NLSYSYSTGADGR,ph,S,647,true,"atm and atr DNA damage response",88,25561503,"MASCOT Score",68.0000000,0.8900000,,,,,0.2500000
NLSYSYSTGADGR,ph,S,647,true,"Lateral root-induction - NAA vs control",106,23328941,"MASCOT Score",22.0000000,,,,,,
NLSYSYSTGADGR,ph,S,647,true,"Tissue atlas Arabidopsis - ProteomicsDB",114,32188942,"MaxQuant score",223.3900000,0.9726560,,,,0,
NLSYSYSTGADGR,ph,S,647,true,"Touch-induced phosphorylation: 40s touch vs untouc",136,30291188,"MASCOT score",80.5100000,,0.6913302,0.0002393,YES,,1.7674424
NLSYSYSTGADGR,ph,T,648,true,"srk2dei ABA signaling phopshoproteomics",83,23572148,"MASCOT Score",58.0000000,,,,,,-0.0003000
NLSYSYSTGADGR,ph,T,648,true,"atm and atr DNA damage response",88,25561503,"MASCOT Score",66.0000000,0.9500000,,,,,0.5500000
IEMISNAETDRK,ph,S,658,true,"Tissue atlas Arabidopsis - ProteomicsDB",114,32188942,"MaxQuant score",105.9500000,0.9993260,,,,9.1942500148434E-5,
LATDAADVKSAIAER,ac,K,801,true,"Quantitative Acetylproteomics",101,29440448,,,,,,,,
FYDPLAGKVMIDGKDIR,ub,K,1068,true,"Ubiquitination Membrane Proteins",120,33585938,,,,,,,,
FYDPLAGKVMIDGK,ub,K,1068,true,"Ubiquitination Membrane Proteins",120,33585938,,,,,,,,
FYDPLAGKVMIDGK,ub,K,1068,true,"upl3 mutant / wildtype",168,35926874,"MaxQuant score",90.7070000,1.0000000,0.7424374,0.3724400,NO,4.3128598917974E-5,2.3815000
GVQLSGGQKQR,ac,K,1154,false,"Quantitative Acetylproteomics",101,29440448,,,,,,,,
GVDCIGVIQDGR,sno,C,1215,true,"hot5-4 / wildtype, FAT-switch S-nitrosoproteome",169,37277371,,,,0.1210214,0.7016699,NO,,
