Peptide,PTM,ModifiedAA,ModifiedPosition,PeptideUniqueToGene,ExperimentDesc,ExpID,PubmedID,ScoreType,IdentScore,LocProb,Log2FChange,PQ-val,QuantSig,PEP,MassErrorPPM
ADGHSFNNISLSGR,nt,A,2,true,"Tic56 chloroplast import - tic56-1",89c,25588737,XCorr,2.8712535,,,,,,
ADGHSFNNISLSGR,nt,A,2,true,"Arg/N-end rule seed, prt6 vs. Wt",99,29168982,"MASCOT Score",35.4300000,,,,,0.027629999443889,-4.3734942
ADGHSFNNISLSGR,nt,A,2,true,"FtsH12 N-terminome: WT / FtsH12 knockdown miRNA",118,33216923,"MaxQuant score",67.9270000,,-1.4840431,0.0102896,YES,4.6200001289909E-13,
ADGHSFNNISLSGR,nta,A,2,true,"Arg/N-end rule pathway Roots",80,25728785,"MASCOT Score",49.9900000,,,,,6.5000000176951E-5,
ADGHSFNNISLSGR,nta,A,2,true,"Tic56 chloroplast import - tic56-1",89c,25588737,XCorr,2.8712535,,,,,,
ADGHSFNNISLSGR,nta,A,2,true,"Arg/N-end rule seed, prt6 vs. Wt",99,29168982,"MASCOT Score",35.4300000,,,,,0.027629999443889,-4.3734942
ADGHSFNNISLSGR,nta,A,2,true,"HUNTER N-terminome: legumain, GluC and trypsin",119,31951383,"MaxQuant score",121.0400000,,,,,,
ADGHSFNNISLSGR,nta,A,2,true,"Arabidopsis translation initiation landscape - NTA",167a,35069635,,,,,,,,
INSGGIQWK,ph,S,27,true,"atm and atr DNA damage response",88,25561503,"MASCOT Score",35.0000000,1.0000000,,,,,-2.2300000
INSGGIQWK,ph,S,27,true,"Tissue atlas Arabidopsis - ProteomicsDB",114,32188942,"MaxQuant score",108.4700000,1.0000000,,,,0.00056428601965308,
VTKSNQLGVK,ac,K,58,true,"Quantitative Acetylproteomics",101,29440448,,,,,,,,
ERHAAGGANMHYF,nt,E,390,true,"Arabidopsis translation initiation landscape - NT",167b,35069635,,,,,,,,
TVAADEGSSKR,ac,K,549,true,"Quantitative Acetylproteomics",101,29440448,,,,,,,,
KTVAADEGSSKR,ub,K,549,true,"Arabidopsis ubiquitination COFRADIC",40,26744219,"MaxQuant Score",78.3240000,1.0000000,,,,9.5609997515567E-5,-0.9240000
YKDEISDYKNPQPMNVDSGNDSDSN,ph,S,639,true,"SnRK2 protein kinase substrates",85,23776212,XCorr,4.0755234,0.9910000,,,,0.00012173099821666,
NPQPMNVDSGNDSDSN,ph,S,639,true,"atm and atr DNA damage response",88,25561503,"MASCOT Score",34.0000000,1.0000000,,,,,1.0700000
NPQPMNVDSGNDSDSN,ph,S,643,true,"atm and atr DNA damage response",88,25561503,"MASCOT Score",34.0000000,1.0000000,,,,,1.0700000
NPQPMNVDSGNDSDSN,ph,S,643,true,"Tissue atlas Arabidopsis - ProteomicsDB",114,32188942,"MaxQuant score",94.8690000,1.0000000,,,,5.2526498504468E-14,
YKDEISDYKNPQPMNVDSGNDSDSN,ph,S,645,true,"SnRK2 protein kinase substrates",85,23776212,XCorr,4.0755234,0.9110000,,,,0.00012173099821666,
NPQPMNVDSGNDSDSN,ph,S,645,true,"atm and atr DNA damage response",88,25561503,"MASCOT Score",34.0000000,1.0000000,,,,,1.0700000
NPQPMNVDSGNDSDSN,ph,S,645,true,"Tissue atlas Arabidopsis - ProteomicsDB",114,32188942,"MaxQuant score",119.6100000,1.0000000,,,,2.5672199342935E-27,
