Peptide,PTM,ModifiedAA,ModifiedPosition,PeptideUniqueToGene,ExperimentDesc,ExpID,PubmedID,ScoreType,IdentScore,LocProb,Log2FChange,PQ-val,QuantSig,PEP,MassErrorPPM
KVEEVKDESSDDAGMMGLFD,ph,S,104,true,"Phosphorylation Early Elicitor Signaling",23,17317660,,,,,,,,
KVEEVKDESSDDAGMMGLFD,ph,S,104,true,"PAMP-triggered phosphorylation",48,24601666,"MASCOT Score",45.3500000,,,,,,
KVEEVKDESSDDAGMMGLFD,ph,S,104,true,"Tyrosine phosphorylation in Arabidopsis",59,18463617,"MASCOT Score",65.0000000,,,,,,-2.3236325
KVEEVKDESSDDAGMMGLFD,ph,S,104,true,"Conserved plant phosphoproteome - Arabidopsis",61a,20466843,"MASCOT Score",52.0000000,1.0000000,,,,,
KVEEVKDESSDDAGMMGLFD,ph,S,104,true,"srk2dei ABA signaling phopshoproteomics",83,23572148,"MASCOT Score",48.0000000,,,,,,-0.0009000
KVEEVKDESSDDAGMMGLFD,ph,S,104,true,"atm and atr DNA damage response",88,25561503,"MASCOT Score",46.0000000,1.0000000,,,,,-1.4500000
VEEVKDESSDDAGMMGLFD,ph,S,104,true,"Tyrosine phosphorylation in Arabidopsis",59,18463617,"MASCOT Score",30.0000000,,,,,,-1.6598941
VEEVKDESSDDAGMMGLFD,ph,S,104,true,"Conserved plant phosphoproteome - Arabidopsis",61a,20466843,"MASCOT Score",57.0000000,1.0000000,,,,,
VEEVKDESSDDAGMMGLFD,ph,S,104,true,"srk2dei ABA signaling phopshoproteomics",83,23572148,"MASCOT Score",26.0000000,,,,,,-0.0009000
VEEVKDESSDDAGMMGLFD,ph,S,104,true,"atm and atr DNA damage response",88,25561503,"MASCOT Score",54.0000000,1.0000000,,,,,-0.7400000
VEEVKDESSDDAGMMGLFD,ph,S,104,true,"Brassinosteroid-Regulated Phosphorylation Dynamics",94,26187819,"MaxQuant Score",188.4900000,1.0000000,,,,2.2479629964699E-41,-0.1500000
VEEVKDESSDDAGMMGLFD,ph,S,104,true,"Phospho cell culture sucrose/TOR",109,30833711,,,1.0000000,,,,,
VEEVKDESSDDAGMMGLFD,ph,S,104,true,"Tissue atlas Arabidopsis - ProteomicsDB",114,32188942,"MaxQuant score",228.5800000,1.0000000,,,,0,
DESSDDAGMMGLFD,ph,S,104,true,"srk2dei ABA signaling phopshoproteomics",83,23572148,"MASCOT Score",26.0000000,,,,,,0.0002000
KVEEVKDESSDDAGMMGLFD,ph,S,105,true,"Phosphorylation Early Elicitor Signaling",23,17317660,,,,,,,,
KVEEVKDESSDDAGMMGLFD,ph,S,105,true,"PAMP-triggered phosphorylation",48,24601666,"MASCOT Score",45.3500000,,,,,,
KVEEVKDESSDDAGMMGLFD,ph,S,105,true,"Tyrosine phosphorylation in Arabidopsis",59,18463617,"MASCOT Score",46.0000000,,,,,,-1.2625665
KVEEVKDESSDDAGMMGLFD,ph,S,105,true,"srk2dei ABA signaling phopshoproteomics",83,23572148,"MASCOT Score",48.0000000,,,,,,-0.0009000
KVEEVKDESSDDAGMMGLFD,ph,S,105,true,"atm and atr DNA damage response",88,25561503,"MASCOT Score",46.0000000,1.0000000,,,,,-1.4500000
VEEVKDESSDDAGMMGLFD,ph,S,105,true,"Tyrosine phosphorylation in Arabidopsis",59,18463617,"MASCOT Score",57.0000000,,,,,,-1.7392835
VEEVKDESSDDAGMMGLFD,ph,S,105,true,"Conserved plant phosphoproteome - Arabidopsis",61a,20466843,"MASCOT Score",30.0000000,1.0000000,,,,,
VEEVKDESSDDAGMMGLFD,ph,S,105,true,"srk2dei ABA signaling phopshoproteomics",83,23572148,"MASCOT Score",26.0000000,,,,,,-0.0009000
VEEVKDESSDDAGMMGLFD,ph,S,105,true,"atm and atr DNA damage response",88,25561503,"MASCOT Score",54.0000000,1.0000000,,,,,-0.7400000
VEEVKDESSDDAGMMGLFD,ph,S,105,true,"Brassinosteroid-Regulated Phosphorylation Dynamics",94,26187819,"MaxQuant Score",188.4900000,1.0000000,,,,2.2479629964699E-41,-0.1500000
VEEVKDESSDDAGMMGLFD,ph,S,105,true,"Tissue atlas Arabidopsis - ProteomicsDB",114,32188942,"MaxQuant score",228.5800000,1.0000000,,,,0,
DESSDDAGMMGLFD,ph,S,105,true,"srk2dei ABA signaling phopshoproteomics",83,23572148,"MASCOT Score",26.0000000,,,,,,0.0002000
