Peptide,PTM,ModifiedAA,ModifiedPosition,PeptideUniqueToGene,ExperimentDesc,ExpID,PubmedID,ScoreType,IdentScore,LocProb,Log2FChange,PQ-val,QuantSig,PEP,MassErrorPPM
DTDSIQLN,nt,D,27,true,"N-terminal ChaFRADIC",92,26010716,"MASCOT Score",39.7500000,,,,,0.0030670000705868,
LKVLSLSNNNFTGNINALSNNNHLQK,ng,N,112,true,"ER-associatied N-glycan degradation chilling stres",133,27558752,,,,,,,,
VLSLSNNNFTGNINALSNNNHLQK,ng,N,112,true,"Conserved N-glycosylation",74,22633491,"MaxQuant Score",231.2200000,0.8890000,,,,0,-0.6150000
VLSLSNNNFTGNINALSNNNHLQK,ng,N,112,true,"N-linked Glycan Micro-heterogeneity Arabidopsis",134,29237727,,,,,,,,
VLSLSNNNFTGNINALSNNNHLQK,ng,N,112,true,"UDP-GlcNAc transporter glycopeptide analysis",135,30224661,,,,,,,2.5325233052562E-19,1.2000000
CSVLNSLNLSR,ng,N,203,true,"Conserved N-glycosylation",74,22633491,"MaxQuant Score",175.3200000,1.0000000,,,,2.3269999423097E-20,-1.7730000
CSVLNSLNLSR,ng,N,203,true,"ER-associatied N-glycan degradation chilling stres",133,27558752,,,,,,,,
SLKDLNLSENK,ng,N,349,true,"Conserved N-glycosylation",74,22633491,"MaxQuant Score",164.0900000,1.0000000,,,,3.6730000864863E-16,1.5450000
YLNLSWNHFNTR,ng,N,445,true,"Conserved N-glycosylation",74,22633491,"MaxQuant Score",138.1600000,1.0000000,,,,3.7710001679452E-14,-0.2260000
VPPEIEFLQNLTVLDLR,ng,N,464,true,"Conserved N-glycosylation",74,22633491,"MaxQuant Score",224.1100000,1.0000000,,,,0,-0.4590000
LLSLSHNNLTGPIPK,ng,N,522,true,"Conserved N-glycosylation",74,22633491,"MaxQuant Score",129.6000000,0.8500000,,,,5.7440001106218E-14,-0.4360000
LLSLSHNNLTGPIPK,ng,N,522,true,"N-Glycopeptide Profiling in Arabidopsis Infloresce",132,27067053,"MOWSE score",21.7000000,,,,,0.0055999998003244,
LLSLSHNNLTGPIPK,ng,N,522,true,"N-linked Glycan Micro-heterogeneity Arabidopsis",134,29237727,,,,,,,,
LLSLSHNNLTGPIPK,ng,N,522,true,"UDP-GlcNAc transporter glycopeptide analysis",135,30224661,,,,,,,1.3007066889358E-17,0.5000000
SSSSSQEFER,ph,S,712,true,"atm and atr DNA damage response",88,25561503,"MASCOT Score",53.0000000,1.0000000,,,,,-1.4900000
SSSSSQEFER,ph,S,713,true,"Tissue atlas Arabidopsis - ProteomicsDB",114,32188942,"MaxQuant score",111.6600000,0.9030590,,,,3.8707401173177E-10,
SSSSSQEFERNPESLLNKASR,ub,K,728,true,"Ubiquitination Membrane Proteins",120,33585938,,,,,,,,
NPESLLNKASR,ub,K,728,true,"upl3 mutant / wildtype",168,35926874,"MaxQuant score",134.4900000,1.0000000,0.9942176,0.0625590,NO,1.9302200726656E-8,0.8492000
IGEGVFGTVYKAPLGEQGR,ub,K,742,true,"Ubiquitination Membrane Proteins",120,33585938,,,,,,,,
