Peptide,PTM,ModifiedAA,ModifiedPosition,PeptideUniqueToGene,ExperimentDesc,ExpID,PubmedID,ScoreType,IdentScore,LocProb,Log2FChange,PQ-val,QuantSig,PEP,MassErrorPPM
STSPLTFPTSGVVEKPWTSYNAR,nt,S,37,true,"N-terminal ChaFRADIC",92,26010716,"MASCOT Score",29.5200000,,,,,3.160000039415E-11,
STSPLTFPTSGVVEKPWTSYNAR,nt,S,37,true,"Stromal N-terminome",96,26371235,"MASCOT Score",39.9800000,,,,,,
STSPLTFPTSGVVEKPWTSYNAR,nt,S,37,true,"HUNTER N-terminome: legumain, GluC and trypsin",119,31951383,"MaxQuant score",111.2600000,,,,,,
STSPLTFPTSGVVEKPWTSYN,nt,S,37,true,"HUNTER N-terminome: legumain, GluC and trypsin",119,31951383,"MaxQuant score",79.4610000,,,,,,
STSPLTFPTSGVVE,nt,S,37,true,"N-terminal ChaFRADIC",92,26010716,"MASCOT Score",21.0600000,,,,,0.00067919999128208,
STSPLTFPTSGVVE,nt,S,37,true,"Arg/N-end rule seed, prt6 vs. Wt",99,29168982,"MASCOT Score",43.2600000,,-0.2534534,0.5504684,NO,0.00030919999699108,1.3239864
STSPLTFPTSGVVE,nt,S,37,true,"HUNTER N-terminome: legumain, GluC and trypsin",119,31951383,"MaxQuant score",150.6600000,,,,,,
STSPLTFPTSGVVEKPWTSYNAR,nta,S,37,true,"N-terminal ChaFRADIC",92,26010716,"MASCOT Score",23.3800000,,,,,6.535000011354E-6,
STSPLTFPTSGVVEKPWTSYNAR,nta,S,37,true,"HUNTER N-terminome: legumain, GluC and trypsin",119,31951383,"MaxQuant score",50.2150000,,,,,,
STSPLTFPTSGVVEKPWTSYN,nta,S,37,true,"HUNTER N-terminome: legumain, GluC and trypsin",119,31951383,"MaxQuant score",,,,,,,
SLTGYQE,nt,S,88,true,"Arg/N-end rule seed, prt6 vs. Wt",99,29168982,"MASCOT Score",42.6700000,,-0.7471433,0.0329904,NO,0.038100000470877,-0.1970363
QITVVPSTFPAAE,nt,Q,265,true,"Arg/N-end rule seed, prt6 vs. Wt",99,29168982,"MASCOT Score",32.4400000,,-0.6558972,0.1913395,NO,1.7189999198308E-5,-8.2129398
SLPGGVEVT,nt,S,369,true,"N-terminal ChaFRADIC",92,26010716,"MASCOT Score",62.4800000,,,,,1.1439999980212E-5,
EFIELMKR,ac,K,424,true,"Quantitative Acetylproteomics",101,29440448,,,,,,,,
EFIELMKR,ub,K,424,true,"Arabidopsis ubiquitination COFRADIC",40,26744219,"MaxQuant Score",57.0470000,1.0000000,,,,0.014999999664724,-0.3960000
