Peptide,PTM,ModifiedAA,ModifiedPosition,PeptideUniqueToGene,ExperimentDesc,ExpID,PubmedID,ScoreType,IdentScore,LocProb,Log2FChange,PQ-val,QuantSig,PEP,MassErrorPPM
MELSVSSPK,ph,S,6,true,"Tissue atlas Arabidopsis - ProteomicsDB",114,32188942,"MaxQuant score",162.3800000,0.8437010,,,,9.3996401119512E-5,
MELSVSSPK,ph,S,7,true,"atm and atr DNA damage response",88,25561503,"MASCOT Score",40.0000000,0.9990000,,,,,-0.6200000
MELSVSSPK,ph,S,7,true,"TOR Kinase and ABA Receptor",100,29290610,XCorr,3.1054406,0.9984000,,,,0.00047379999887198,
MELSVSSPK,ph,S,7,true,"Phospho cell culture sucrose/TOR",109,30833711,,,0.9661820,,,,,
MELSVSSPK,ph,S,7,true,"Tissue atlas Arabidopsis - ProteomicsDB",114,32188942,"MaxQuant score",144.7000000,0.9754580,,,,0.00010587999713607,
SQSLEQDSSDQAFSRPYR,ph,S,48,true,"Tissue atlas Arabidopsis - ProteomicsDB",114,32188942,"MaxQuant score",60.1340000,0.9999440,,,,0.00054971699137241,
SQSLEQDSSDQAFSR,ph,S,48,true,"atm and atr DNA damage response",88,25561503,"MASCOT Score",63.0000000,0.9680000,,,,,-0.6000000
SQSLEQDSSDQAFSRPYR,ph,S,50,true,"TOR Kinase and ABA Receptor",100,29290610,XCorr,2.6254904,0.9738000,,,,0.017810000106692,
SQSLEQDSSDQAFSR,ph,S,50,true,"atm and atr DNA damage response",88,25561503,"MASCOT Score",83.0000000,0.9460000,,,,,-1.5300000
SQSLEQDSSDQAFSR,ph,S,50,true,"Phospho cell culture sucrose/TOR",109,30833711,,,0.9998980,,,,,
SQSLEQDSSDQAFSR,ph,S,50,true,"Tissue atlas Arabidopsis - ProteomicsDB",114,32188942,"MaxQuant score",251.0400000,0.9999940,,,,0,
GSNSQANSKEK,ph,S,374,true,"atm and atr DNA damage response",88,25561503,"MASCOT Score",39.0000000,1.0000000,,,,,-2.3300000
KPTQKAMR,ub,K,435,true,"Arabidopsis ubiquitination COFRADIC",40,26744219,"MaxQuant Score",56.9160000,0.9990000,,,,0.0089999996125698,-0.5150000
VKLDTASDSGAAIASPK,ph,S,657,true,"STN8 phosphoproteome",38,21768351,"MASCOT Score",84.4300000,,,,,,-0.8589490
VKLDTASDSGAAIASPK,ph,S,657,true,"Chloroplast kinase substrates",60,19376835,"MASCOT Score",80.6500000,,,,,,-0.8589490
VKLDTASDSGAAIASPK,ph,S,657,true,"SnRK2 protein kinase substrates",85,23776212,XCorr,3.1232755,1.0000000,,,,3.322039887621E-8,
VKLDTASDSGAAIASPK,ph,S,657,true,"atm and atr DNA damage response",88,25561503,"MASCOT Score",58.0000000,1.0000000,,,,,-1.9700000
VKLDTASDSGAAIASPK,ph,S,657,true,"Tissue atlas Arabidopsis - ProteomicsDB",114,32188942,"MaxQuant score",317.3100000,1.0000000,,,,0,
VKLDTASDSGAAIASPK,ph,S,657,true,"Touch-induced phosphorylation: 40s touch vs untouc",136,30291188,"MASCOT score",103.3600000,,-0.0692800,0.7105833,NO,,5.4417881
LDTASDSGAAIASPK,ph,S,657,true,"STN8 phosphoproteome",38,21768351,"MASCOT Score",102.8700000,,,,,,-1.4194200
LDTASDSGAAIASPK,ph,S,657,true,"Tyrosine phosphorylation in Arabidopsis",59,18463617,"MASCOT Score",53.0000000,,,,,,-0.3372318
LDTASDSGAAIASPK,ph,S,657,true,"srk2dei ABA signaling phopshoproteomics",83,23572148,"MASCOT Score",85.0000000,,,,,,0.0002000
LDTASDSGAAIASPK,ph,S,657,true,"SnRK2 protein kinase substrates",85,23776212,XCorr,3.0791883,1.0000000,,,,1.1558100032616E-9,
LDTASDSGAAIASPK,ph,S,657,true,"atm and atr DNA damage response",88,25561503,"MASCOT Score",87.0000000,1.0000000,,,,,0.1100000
LDTASDSGAAIASPK,ph,S,657,true,"TOR Kinase and ABA Receptor",100,29290610,XCorr,5.6723404,1.0000000,,,,2.1800000027383E-8,
LDTASDSGAAIASPK,ph,S,657,true,"Lateral root-induction - NAA vs control",106,23328941,"MASCOT Score",58.0000000,,,,,,
LDTASDSGAAIASPK,ph,S,657,true,"Phospho cell culture sucrose/TOR",109,30833711,,,0.9999960,,,,,
LSTETPSPDSK,ph,S,685,true,"atm and atr DNA damage response",88,25561503,"MASCOT Score",55.0000000,1.0000000,,,,,0.0400000
LSTETPSPDSK,ph,S,685,true,"Lateral root-induction - NAA vs control",106,23328941,"MASCOT Score",34.0000000,,,,,,
LSTETPSPDSK,ph,S,685,true,"Tissue atlas Arabidopsis - ProteomicsDB",114,32188942,"MaxQuant score",193.1500000,0.9991500,,,,2.3893399438857E-18,
TSSTEEPENTNVSGDNDSTLDKQETK,ph,S,849,true,"STN8 phosphoproteome",38,21768351,"MASCOT Score",49.2200000,,,,,,-1.2399000
TSSTEEPENTNVSGDNDSTLDKQETK,ph,S,849,true,"Phospho cell culture sucrose/TOR",109,30833711,,,0.9614900,,,,,
TSSTEEPENTNVSGDNDSTLDKQETK,ph,S,849,true,"Tissue atlas Arabidopsis - ProteomicsDB",114,32188942,"MaxQuant score",190.2300000,0.9917420,,,,0,
TSSTEEPENTNVSGDNDSTLDK,ph,T,850,true,"Lateral root-induction - NAA vs control",106,23328941,"MASCOT Score",22.0000000,,,,,,
TSSTEEPENTNVSGDNDSTLDKQETK,ph,S,859,true,"Tissue atlas Arabidopsis - ProteomicsDB",114,32188942,"MaxQuant score",119.5400000,0.9765630,,,,2.1343400418357E-34,
