Peptide,PTM,ModifiedAA,ModifiedPosition,PeptideUniqueToGene,ExperimentDesc,ExpID,PubmedID,ScoreType,IdentScore,LocProb,Log2FChange,PQ-val,QuantSig,PEP,MassErrorPPM
RRTVKSTPQSIWYGPD,nt,R,39,false,"HUNTER N-terminome: legumain, GluC and trypsin",119,31951383,"MaxQuant score",65.1720000,,,,,,
RRTVKSTPQSIWYGPDRPKYLGPFSEN,nta,R,39,false,"HUNTER N-terminome: legumain, GluC and trypsin",119,31951383,"MaxQuant score",104.8700000,,,,,,
RRTVKSTPQSIWYGPDRPKYLGPFSE,nta,R,39,false,"HUNTER N-terminome: legumain, GluC and trypsin",119,31951383,"MaxQuant score",65.0710000,,,,,,
RRTVKSTPQSIWYGPDR,nta,R,39,false,"HUNTER N-terminome: legumain, GluC and trypsin",119,31951383,"MaxQuant score",51.2650000,,,,,,
RRTVKSTPQSIWYGPD,nta,R,39,false,"HUNTER N-terminome: legumain, GluC and trypsin",119,31951383,"MaxQuant score",47.2880000,,,,,,
TVKSTPQSIWYGPDRPKYLGPFSE,nt,T,41,false,"HUNTER N-terminome: legumain, GluC and trypsin",119,31951383,"MaxQuant score",61.2220000,,,,,,
TVKSTPQSIWYGPDR,nt,T,41,false,"HUNTER N-terminome: legumain, GluC and trypsin",119,31951383,"MaxQuant score",70.1970000,,,,,,
TVKSTPQSIWYGPDRPK,ph,T,41,false,"Phosphoproteome ethylene-regulated time response",46,24043427,"MASCOT Score",89.2900000,,,,,,-2.3585000
TVKSTPQSIWYGPDRPK,ph,T,41,false,"atm and atr DNA damage response",88,25561503,"MASCOT Score",36.0000000,1.0000000,,,,,-0.4800000
TVKSTPQSIWYGPDRPK,ph,T,41,false,"Tissue atlas Arabidopsis - ProteomicsDB",114,32188942,"MaxQuant score",165.6600000,0.9998950,,,,5.6109298767085E-18,
RTVKSTPQSIWYGPDRPK,ac,K,43,false,"Quantitative Acetylproteomics",101,29440448,,,,,,,,
TVKSTPQSIWYGPDRPK,ac,K,43,false,"Histone deacetylases - hda14 vs WT (thylakoids)",98d,29061669,"MaxQuant Score",98.1000000,1.0000000,1.2600000,0.1753881,NO,2.1500000391139E-10,
TVKSTPQSIWYGPDRPK,ac,K,43,false,"Quantitative Acetylproteomics",101,29440448,,,,,,,,
STPQSIWYGPDR,nt,S,44,false,"HUNTER N-terminome: legumain, GluC and trypsin",119,31951383,"MaxQuant score",75.8190000,,,,,,
TVKSTPQSIWYGPDRPK,ph,S,44,false,"atm and atr DNA damage response",88,25561503,"MASCOT Score",21.0000000,0.9940000,,,,,0.6500000
STPQSIWYGPDRPK,ph,S,44,false,"atm and atr DNA damage response",88,25561503,"MASCOT Score",61.0000000,1.0000000,,,,,0.8200000
STPQSIWYGPDRPK,ph,S,44,false,"Tissue atlas Arabidopsis - ProteomicsDB",114,32188942,"MaxQuant score",163.6400000,0.8484010,,,,1.0087999879893E-10,
STPQSIWYGPDRPK,ph,S,48,false,"Tissue atlas Arabidopsis - ProteomicsDB",114,32188942,"MaxQuant score",106.4200000,0.9997640,,,,0.00017434899928048,
STPQSIWYGPDRPK,ac,K,57,false,"Quantitative Acetylproteomics",101,29440448,,,,,,,,
TPSYLTGEYPGDYGWDTAGLSADPETFAKNR,nt,T,66,false,"HUNTER N-terminome: legumain, GluC and trypsin",119,31951383,"MaxQuant score",50.8910000,,,,,,
LTGEYPGDYGWDTAGLSADPE,nt,L,70,false,"HUNTER N-terminome: legumain, GluC and trypsin",119,31951383,"MaxQuant score",58.5770000,,,,,,
TGEYPGDYGWDTAGLSADPETFAKNR,nt,T,71,false,"HUNTER N-terminome: legumain, GluC and trypsin",119,31951383,"MaxQuant score",41.4230000,,,,,,
TAGLSADPETFAKN,nt,T,82,false,"HUNTER N-terminome: legumain, GluC and trypsin",119,31951383,"MaxQuant score",86.3130000,,,,,,
ELEVIHSR,ph,S,103,false,"atm and atr DNA damage response",88,25561503,"MASCOT Score",53.0000000,1.0000000,,,,,-0.4300000
NGVKFGEAVWFK,ac,K,125,false,"Lysine acetylation gel-based Finkemeier et al",37,21311031,i-probability,0.7437590,,,,,,
NGVKFGEAVWFK,ac,K,125,false,"Histone deacetylases - hda14 vs WT (thylakoids)",98d,29061669,"MaxQuant Score",53.4000000,1.0000000,-0.0020000,0.9977001,NO,0.012000000104308,
