Peptide,PTM,ModifiedAA,ModifiedPosition,PeptideUniqueToGene,ExperimentDesc,ExpID,PubmedID,ScoreType,IdentScore,LocProb,Log2FChange,PQ-val,QuantSig,PEP,MassErrorPPM
GTSVDNREESEPGDEDSDQEELDR,ph,S,276,true,"atm and atr DNA damage response",88,25561503,"MASCOT Score",50.0000000,1.0000000,,,,,-0.5000000
GTSVDNREESEPGDEDSDQEELDR,ph,S,283,true,"atm and atr DNA damage response",88,25561503,"MASCOT Score",50.0000000,1.0000000,,,,,-0.5000000
GTSVDNREESEPGDEDSDQEELDR,ph,S,283,true,"TOR Kinase and ABA Receptor",100,29290610,XCorr,3.6847856,1.0000000,,,,8.5840002839177E-7,
EESEPGDEDSDQEELDR,ph,S,283,true,"STN8 phosphoproteome",38,21768351,"MASCOT Score",43.6500000,,,,,,-3.0996100
EESEPGDEDSDQEELDR,ph,S,283,true,"LAXIC - mannitol vs control",84b,23660473,XCorr,4.2700000,1.0000000,,,,5.5400000746886E-6,
EESEPGDEDSDQEELDR,ph,S,283,true,"atm and atr DNA damage response",88,25561503,"MASCOT Score",44.0000000,1.0000000,,,,,0.3000000
RPNDSDDDDDDGELDSEDDEIPK,ph,S,360,true,"srk2dei ABA signaling phopshoproteomics",83,23572148,"MASCOT Score",21.0000000,,,,,,-0.0006000
RPNDSDDDDDDGELDSEDDEIPK,ph,S,360,true,"Brassinosteroid-Regulated Phosphorylation Dynamics",94,26187819,"MaxQuant Score",146.5700000,1.0000000,,,,1.7380000376448E-16,0.3280000
RPNDSDDDDDDGELDSEDDEIPK,ph,S,360,true,"TOR Kinase and ABA Receptor",100,29290610,XCorr,5.3014302,1.0000000,,,,1.5190000368648E-8,
RPNDSDDDDDDGELDSEDDEIPK,ph,S,360,true,"Col-0 callus - FC Col-0 vs. Col-0 Xray",111a,31410901,,29.1800000,,1.0510624,0.0000000,NO,,1.4763866
RPNDSDDDDDDGELDSEDDEIPK,ph,S,360,true,"Col-0 X-ray callus - FC Col-0 vs. Col-0 Xray",111b,31410901,,29.1800000,,1.0510624,0.0000000,NO,,1.4763866
RPNDSDDDDDDGELDSEDDEIPK,ph,S,360,true,"atm callus - FC atm vs. atm Xray",111c,31410901,,29.1800000,,4.9781094,0.0000000,NO,,1.4763866
RPNDSDDDDDDGELDSEDDEIPK,ph,S,360,true,"atm-3 X-ray callus - FC atm vs. atm Xray",111d,31410901,,29.1800000,,4.9781094,0.0000000,NO,,1.4763866
RPNDSDDDDDDGELDSEDDEIPK,ph,S,371,true,"srk2dei ABA signaling phopshoproteomics",83,23572148,"MASCOT Score",21.0000000,,,,,,-0.0006000
RPNDSDDDDDDGELDSEDDEIPK,ph,S,371,true,"Brassinosteroid-Regulated Phosphorylation Dynamics",94,26187819,"MaxQuant Score",146.5700000,1.0000000,,,,1.7380000376448E-16,0.3280000
RPNDSDDDDDDGELDSEDDEIPK,ph,S,371,true,"TOR Kinase and ABA Receptor",100,29290610,XCorr,5.3014302,1.0000000,,,,1.5190000368648E-8,
RPNDSDDDDDDGELDSEDDEIPK,ph,S,371,true,"Col-0 callus - FC Col-0 vs. Col-0 Xray",111a,31410901,,29.1800000,,1.0510624,0.0000000,NO,,1.4763866
RPNDSDDDDDDGELDSEDDEIPK,ph,S,371,true,"Col-0 X-ray callus - FC Col-0 vs. Col-0 Xray",111b,31410901,,29.1800000,,1.0510624,0.0000000,NO,,1.4763866
RPNDSDDDDDDGELDSEDDEIPK,ph,S,371,true,"atm callus - FC atm vs. atm Xray",111c,31410901,,29.1800000,,4.9781094,0.0000000,NO,,1.4763866
RPNDSDDDDDDGELDSEDDEIPK,ph,S,371,true,"atm-3 X-ray callus - FC atm vs. atm Xray",111d,31410901,,29.1800000,,4.9781094,0.0000000,NO,,1.4763866
TVSASSSKQSR,ub,K,460,true,"Arabidopsis ubiquitination COFRADIC",40,26744219,"MaxQuant Score",96.6040000,1.0000000,,,,0.00056349998340011,0.0260000
QRDEDWDSD,ph,S,490,true,"Tyrosine phosphorylation in Arabidopsis",59,18463617,"MASCOT Score",32.0000000,,,,,,-0.6428814
QRDEDWDSD,ph,S,490,true,"atm and atr DNA damage response",88,25561503,"MASCOT Score",36.0000000,1.0000000,,,,,0.0400000
QRDEDWDSD,ph,S,490,true,"Phospho cell culture sucrose/TOR",109,30833711,,,1.0000000,,,,,
QRDEDWDSD,ph,S,490,true,"Tissue atlas Arabidopsis - ProteomicsDB",114,32188942,"MaxQuant score",195.3600000,1.0000000,,,,2.8976798738256E-10,
