Peptide,PTM,ModifiedAA,ModifiedPosition,PeptideUniqueToGene,ExperimentDesc,ExpID,PubmedID,ScoreType,IdentScore,LocProb,Log2FChange,PQ-val,QuantSig,PEP,MassErrorPPM
TSTGAEAETKASSGGGR,nt,T,29,true,"Arg/N-end rule pathway Roots",80,25728785,"MASCOT Score",78.8600000,,,,,1.649000047621E-8,
TSTGAEAETKASSGGGR,nt,T,29,true,"N-terminal ChaFRADIC",92,26010716,"MASCOT Score",21.8300000,,,,,2.9969998704971E-10,
TSTGAEAETKASSGGGR,nt,T,29,true,"Mitochondrial intermediate peptidases - icp55 / WT",131a,25732537,,114.2600000,,-0.0605485,,,,
TSTGAEAETKASSGGGR,nt,T,29,true,"Mitochondrial intermediate peptidases - oct1-1 / WT",131b,25732537,,120.7200000,,1.3230353,,,,
TSTGAEAETKASSGGGR,nt,T,29,true,"Mitochondrial intermediate peptidases - oct1-2 / WT",131c,25732537,,107.4300000,,-0.3626428,,,,
TSTGAEAETKASSGGGR,nta,T,29,true,"FtsH12 N-terminome: WT / FtsH12 knockdown miRNA",118,33216923,"MaxQuant score",98.0440000,,,,,2.4999999368447E-5,
DCGPMVLDALIK,ox,C,77,false,"Redox kickstart of mitochondria",112,31871212,,,,-0.8234059,0.0038425,YES,,
IKNEMDPSLTFR,ac,K,89,false,"Quantitative Acetylproteomics",101,29440448,,,,,,,,
SIEPWLKR,ac,K,166,false,"Quantitative Acetylproteomics",101,29440448,,,,,,,,
LEAIDDEFKLYR,ub,K,247,false,"Arabidopsis ubiquitination COFRADIC",40,26744219,"MaxQuant Score",117.7900000,1.0000000,,,,9.4470001266167E-11,0.1760000
