Peptide,PTM,ModifiedAA,ModifiedPosition,PeptideUniqueToGene,ExperimentDesc,ExpID,PubmedID,ScoreType,IdentScore,LocProb,Log2FChange,PQ-val,QuantSig,PEP,MassErrorPPM
GSGQWHMEKR,ph,S,3,true,"Tissue atlas Arabidopsis - ProteomicsDB",114,32188942,"MaxQuant score",169.6500000,1.0000000,,,,2.0301900804043E-5,
STLKNDSFVK,ph,S,12,true,"Tissue atlas Arabidopsis - ProteomicsDB",114,32188942,"MaxQuant score",120.5500000,0.8927780,,,,0.00026507399161346,
STLKNDSFVK,ph,T,13,true,"atm and atr DNA damage response",88,25561503,"MASCOT Score",41.0000000,0.9940000,,,,,-1.7300000
STLKNDSFVK,ph,T,13,true,"Tissue atlas Arabidopsis - ProteomicsDB",114,32188942,"MaxQuant score",161.0800000,0.9745860,,,,5.9389201889637E-11,
STLKNDSFVK,ac,K,15,true,"Quantitative Acetylproteomics",101,29440448,,,,,,,,
STLKNDSFVK,ph,S,18,true,"Tissue atlas Arabidopsis - ProteomicsDB",114,32188942,"MaxQuant score",174.7200000,1.0000000,,,,1.3448600100219E-7,
QGFLNPDEVHIFGYAR,nt,Q,58,false,"HUNTER N-terminome: legumain, GluC and trypsin",119,31951383,"MaxQuant score",80.9790000,,,,,,
SKITDEELR,ub,K,75,true,"Arabidopsis ubiquitination COFRADIC",40,26744219,"MaxQuant Score",67.1130000,1.0000000,,,,0.010999999940395,0.3920000
YVSGPYDSEEGFKR,ac,K,123,true,"Quantitative Acetylproteomics",101,29440448,,,,,,,,
CQNQGR,sno,C,384,true,"hot5-4 / wildtype, FAT-switch S-nitrosoproteome",169,37277371,,,,,,,,
QGSRGPAEADQLLK,ph,S,488,true,"Phosphorylation in N starvation",63,22060019,"MASCOT Score",22.0000000,,,,,,6.2606200
