Peptide,PTM,ModifiedAA,ModifiedPosition,PeptideUniqueToGene,ExperimentDesc,ExpID,PubmedID,ScoreType,IdentScore,LocProb,Log2FChange,PQ-val,QuantSig,PEP,MassErrorPPM
TGITEMVSSVGHSCGK,acy,C,136,true,"Arabidopsis S-acylation atlas - Meristem",163a,35681017,,,,,,,,
TGITEMVSSVGHSCGK,acy,C,136,true,"Arabidopsis S-acylation atlas - Hypocotyl",163b,35681017,,,,,,,,
TGITEMVSSVGHSCGK,acy,C,136,true,"Arabidopsis S-acylation atlas - Leaf",163c,35681017,,,,,,,,
TGITEMVSSVGHSCGK,acy,C,136,true,"Arabidopsis S-acylation atlas - Silique",163e,35681017,,,,,,,,
TGITEMVSSVGHSCGK,acy,C,136,true,"Arabidopsis S-acylation atlas - Stem",163f,35681017,,,,,,,,
CPDDWSLGQK,acy,C,155,true,"Arabidopsis S-acylation atlas - Meristem",163a,35681017,,,,,,,,
CPDDWSLGQK,acy,C,155,true,"Arabidopsis S-acylation atlas - Hypocotyl",163b,35681017,,,,,,,,
CPDDWSLGQK,acy,C,155,true,"Arabidopsis S-acylation atlas - Stem",163f,35681017,,,,,,,,
CPDDWSLGQK,sno,C,155,true,"hot5-4 / wildtype, FAT-switch S-nitrosoproteome",169,37277371,,,,,,,,
ACEPLPR,acy,C,170,false,"Arabidopsis S-acylation atlas - Meristem",163a,35681017,,,,,,,,
ACEPLPR,acy,C,170,false,"Arabidopsis S-acylation atlas - Hypocotyl",163b,35681017,,,,,,,,
ACEPLPR,acy,C,170,false,"Arabidopsis S-acylation atlas - Leaf",163c,35681017,,,,,,,,
ACEPLPR,acy,C,170,false,"Arabidopsis S-acylation atlas - Silique",163e,35681017,,,,,,,,
ACEPLPR,ox,C,170,false,"OxiTRAQ Arabidopsis - 5 mM H2O2 versus control",47,24376095,,,,-0.1957821,0.0548547,NO,,
ACEPLPR,sno,C,170,false,"hot5-4 / wildtype, FAT-switch S-nitrosoproteome",169,37277371,,,,,,,,
TVQKQDLSKSPDSLWR,ph,S,194,true,"TOR Kinase and ABA Receptor",100,29290610,XCorr,2.2012696,0.9549000,,,,0.023110000416636,
SVNWSGLGCK,acy,C,211,false,"Arabidopsis S-acylation atlas - Leaf",163c,35681017,,,,,,,,
SVNWSGLGCK,acy,C,211,false,"Arabidopsis S-acylation atlas - Seedling",163d,35681017,,,,,,,,
SVNWSGLGCK,acy,C,211,false,"Arabidopsis S-acylation atlas - Stem",163f,35681017,,,,,,,,
SVNWSGLGCK,ox,C,211,false,"OxiTRAQ Arabidopsis - 5 mM H2O2 versus control",47,24376095,,,,-0.1510981,0.1258365,NO,,
SFDCLK,ox,C,216,true,"OxiTRAQ Arabidopsis - 5 mM H2O2 versus control",47,24376095,,,,-0.1833532,0.1093260,NO,,
SFDCLK,sno,C,216,true,"hot5-4 / wildtype, FAT-switch S-nitrosoproteome",169,37277371,,,,,,,,
ECVGCFDLGVEKDR,acy,C,226,true,"Arabidopsis S-acylation atlas - Meristem",163a,35681017,,,,,,,,
ECVGCFDLGVEKDR,acy,C,226,true,"Arabidopsis S-acylation atlas - Silique",163e,35681017,,,,,,,,
ECVGCFDLGVEK,acy,C,226,true,"Arabidopsis S-acylation atlas - Hypocotyl",163b,35681017,,,,,,,,
ECVGCFDLGVEKDR,acy,C,229,true,"Arabidopsis S-acylation atlas - Meristem",163a,35681017,,,,,,,,
ECVGCFDLGVEKDR,acy,C,229,true,"Arabidopsis S-acylation atlas - Silique",163e,35681017,,,,,,,,
ECVGCFDLGVEK,acy,C,229,true,"Arabidopsis S-acylation atlas - Hypocotyl",163b,35681017,,,,,,,,
MAEKNVTVITNTLNNGAPFSEFIAAR,ng,N,282,true,"Conserved N-glycosylation",74,22633491,"MaxQuant Score",178.9300000,1.0000000,,,,0,1.0510000
