Peptide,PTM,ModifiedAA,ModifiedPosition,PeptideUniqueToGene,ExperimentDesc,ExpID,PubmedID,ScoreType,IdentScore,LocProb,Log2FChange,PQ-val,QuantSig,PEP,MassErrorPPM
FSSGYNVQVFVE,nt,F,81,true,"Arg/N-end rule seed, prt6 vs. Wt",99,29168982,"MASCOT Score",51.6500000,,-0.6583307,0.2066897,NO,0.0019239999819547,4.4941688
SSGYNVQVFVEDNESEER,nt,S,82,true,"Stromal N-terminome",96,26371235,"MASCOT Score",54.7600000,,,,,,
SSGYNVQVFVEDNESEER,nt,S,82,true,"Arg/N-end rule seed, prt6 vs. Wt",99,29168982,"MASCOT Score",53.3000000,,-0.8752332,0.2282651,NO,0.0015970000531524,-1.4060727
SSGYNVQVFVEDNESEER,nt,S,82,true,"HUNTER N-terminome: legumain, GluC and trypsin",119,31951383,"MaxQuant score",63.8940000,,,,,,
SSGYNVQVFVEDNESEER,nt,S,82,true,"Arabidopsis translation initiation landscape - NT",167b,35069635,,,,,,,,
SSGYNVQVFVE,nt,S,82,true,"Arg/N-end rule seed, prt6 vs. Wt",99,29168982,"MASCOT Score",59.4200000,,-0.3991729,0.0164637,NO,4.6899999688321E-6,-2.2844033
SGYNVQVFVE,nt,S,83,true,"Arg/N-end rule seed, prt6 vs. Wt",99,29168982,"MASCOT Score",35.6500000,,-0.2701901,0.1006099,NO,0.030939999967813,-4.8117200
VFVEDNESEER,nt,V,89,true,"Arg/N-end rule seed, prt6 vs. Wt",99,29168982,"MASCOT Score",60.7200000,,-1.0254614,0.1251909,NO,0.0098519995808601,-0.7905359
TGVIQECK,sno,C,117,true,"hot5-4 / wildtype, FAT-switch S-nitrosoproteome",169,37277371,,,,0.4601324,0.0215470,NO,,
TGVIQECK,so,C,117,true,"Arabidopsis S-sulfenylation chemoproteomics",108,31578252,"pFind PSM Score",0.1962420,,2.2222200,,,,-0.2647472
TGVIQECKR,ub,K,118,true,"Arabidopsis ubiquitination COFRADIC",40,26744219,"MaxQuant Score",86.1800000,1.0000000,,,,0.0049999998882413,-0.3240000
YFENKQDEKKR,ub,K,126,true,"Arabidopsis ubiquitination COFRADIC",40,26744219,"MaxQuant Score",100.9300000,1.0000000,,,,6.1160001507687E-8,-0.1560000
YFENKQDEKKR,ub,K,130,true,"Arabidopsis ubiquitination COFRADIC",40,26744219,"MaxQuant Score",140.2400000,0.9030000,,,,3.3109999117431E-12,-0.7040000
YFENKQDEKKR,ub,K,131,true,"Arabidopsis ubiquitination COFRADIC",40,26744219,"MaxQuant Score",72.2900000,0.8710000,,,,0.00013400000170805,0.4000000
EEAAAATKSK,ac,K,163,true,"Quantitative Acetylproteomics",101,29440448,,,,,,,,
