Peptide,PTM,ModifiedAA,ModifiedPosition,PeptideUniqueToGene,ExperimentDesc,ExpID,PubmedID,ScoreType,IdentScore,LocProb,Log2FChange,PQ-val,QuantSig,PEP,MassErrorPPM
ISSSTGTR,ph,S,50,true,"atm and atr DNA damage response",88,25561503,"MASCOT Score",25.0000000,0.9950000,,,,,-0.0400000
SSHNFSGGSREPSVAAEE,nt,S,62,true,"Arabidopsis translation initiation landscape - NT",167b,35069635,,,,,,,,
EPSVAAEEGHSR,ph,S,82,true,"Tissue atlas Arabidopsis - ProteomicsDB",114,32188942,"MaxQuant score",57.3150000,0.9999590,,,,0.0046568000689149,
ESFSPPNADKR,ph,S,100,true,"atm and atr DNA damage response",88,25561503,"MASCOT Score",33.0000000,1.0000000,,,,,-0.2200000
ESFSPPNADKR,ph,S,100,true,"Tissue atlas Arabidopsis - ProteomicsDB",114,32188942,"MaxQuant score",158.8600000,0.9999770,,,,1.0473100164887E-10,
ESFSPPNADK,ph,S,100,true,"TOR Kinase and ABA Receptor",100,29290610,XCorr,2.7088668,0.9994000,,,,0.018540000542998,
NQTQSLSPPDVSR,ph,S,428,true,"atm and atr DNA damage response",88,25561503,"MASCOT Score",64.0000000,1.0000000,,,,,0.2500000
NQTQSLSPPDVSR,ph,S,428,true,"Tissue atlas Arabidopsis - ProteomicsDB",114,32188942,"MaxQuant score",166.7900000,0.9999290,,,,5.6163599534704E-15,
NQTQSLSPPDVSR,ph,S,430,true,"Large-scale phosphorylation discovery",44,23111157,XCorr,3.6320000,,,,,,
NQTQSLSPPDVSR,ph,S,430,true,"Tyrosine phosphorylation in Arabidopsis",59,18463617,"MASCOT Score",62.0000000,,,,,,-0.3316384
NQTQSLSPPDVSR,ph,S,430,true,"atm and atr DNA damage response",88,25561503,"MASCOT Score",64.0000000,1.0000000,,,,,0.2500000
NQTQSLSPPDVSR,ph,S,430,true,"Phospho cell culture sucrose/TOR",109,30833711,,,0.9926360,,,,,
NQTQSLSPPDVSR,ph,S,430,true,"Tissue atlas Arabidopsis - ProteomicsDB",114,32188942,"MaxQuant score",292.7600000,0.9999990,,,,0,
STEDSSADKSDGESQSSLEK,ph,S,463,true,"Tissue atlas Arabidopsis - ProteomicsDB",114,32188942,"MaxQuant score",161.4600000,0.9738010,,,,4.1207798943217E-29,
STEDSSADKSDGESQSSLEK,ph,S,468,true,"SnRK2 protein kinase substrates",85,23776212,XCorr,4.8471770,1.0000000,,,,0.01021290011704,
STEDSSADKSDGESQSSLEK,ph,S,468,true,"atm and atr DNA damage response",88,25561503,"MASCOT Score",21.0000000,1.0000000,,,,,0.4400000
STEDSSADKSDGESQSSLEK,ph,S,468,true,"TOR Kinase and ABA Receptor",100,29290610,XCorr,6.0987773,0.9981000,,,,1.9240000703746E-9,
STEDSSADKSDGESQSSLEK,ph,S,468,true,"Tissue atlas Arabidopsis - ProteomicsDB",114,32188942,"MaxQuant score",264.4400000,0.9999990,,,,0,
GFLSHQIDTK,ph,S,507,true,"Tissue atlas Arabidopsis - ProteomicsDB",114,32188942,"MaxQuant score",122.4600000,1.0000000,,,,0.00012091799726477,
SSFSHVTR,ph,S,685,true,"atm and atr DNA damage response",88,25561503,"MASCOT Score",30.0000000,0.9910000,,,,,-0.1900000
SSFSHVTR,ph,S,685,true,"Tissue atlas Arabidopsis - ProteomicsDB",114,32188942,"MaxQuant score",78.9320000,0.8265840,,,,0.009723880328238,
LGFAAGHDSPNLNNEPTNVQSSSSSSEVSNATTGAR,ph,S,700,true,"Tissue atlas Arabidopsis - ProteomicsDB",114,32188942,"MaxQuant score",108.6000000,0.9472160,,,,1.3202700621834E-38,
VLLSTTSVRR,ph,S,768,true,"atm and atr DNA damage response",88,25561503,"MASCOT Score",35.0000000,0.8770000,,,,,0.1700000
VLLSTTSVRR,ph,S,768,true,"Tissue atlas Arabidopsis - ProteomicsDB",114,32188942,"MaxQuant score",175.4900000,0.9725440,,,,2.1558000298683E-5,
VLLSTTSVR,ph,S,768,true,"atm and atr DNA damage response",88,25561503,"MASCOT Score",33.0000000,0.9450000,,,,,-0.5900000
VLLSTTSVR,ph,S,768,true,"TOR Kinase and ABA Receptor",100,29290610,XCorr,2.6743851,0.9341000,,,,0.0081460000947118,
VLLSTTSVR,ph,S,768,true,"Phospho cell culture sucrose/TOR",109,30833711,,,0.7780500,,,,,
