Peptide,PTM,ModifiedAA,ModifiedPosition,PeptideUniqueToGene,ExperimentDesc,ExpID,PubmedID,ScoreType,IdentScore,LocProb,Log2FChange,PQ-val,QuantSig,PEP,MassErrorPPM
EYIEYNTKPRIVPEKINVHLVPHSH,nt,E,23,true,"Arabidopsis translation initiation landscape - NT",167b,35069635,,,,,,,,
EYIEYNTKPR,nt,E,23,true,"Arg/N-end rule pathway Roots",80,25728785,"MASCOT Score",39.2800000,,,,,0.087779998779297,
EYIEYNTKPR,nt,E,23,true,"FtsH12 N-terminome: WT / FtsH12 knockdown miRNA",118,33216923,"MaxQuant score",158.2900000,,-0.4359633,0.0472750,NO,0,
TVDQYYVGSNNSIR,ng,N,64,true,"Conserved N-glycosylation",74,22633491,"MaxQuant Score",194.9000000,0.9910000,,,,7.8192454309325E-42,-0.8290000
TVDQYYVGSNNSIR,ng,N,64,true,"N-glycan occupancy Arabidopsis glycoproteins",87,23994444,"Ladder score",75.3000000,,,,,,
TVDQYYVGSNNSIR,ng,N,64,true,"N-Glycopeptide Profiling in Arabidopsis Infloresce",132,27067053,"MOWSE score",23.3000000,,,,,0.00056000001495704,
TVDQYYVGSNNSIR,ng,N,64,true,"ER-associatied N-glycan degradation chilling stres",133,27558752,,,,,,,,
TVDQYYVGSNNSIR,ng,N,64,true,"N-linked Glycan Micro-heterogeneity Arabidopsis",134,29237727,,,,,,,,
TVDQYYVGSNNSIR,ng,N,64,true,"UDP-GlcNAc transporter glycopeptide analysis",135,30224661,,,,,,,5.0228007517084E-13,1.0000000
VNDFVAAALAQVNVTR,ng,N,278,true,"Conserved N-glycosylation",74,22633491,"MaxQuant Score",198.4000000,1.0000000,,,,0,-0.9050000
YAANESWPLK,ng,N,336,true,"Conserved N-glycosylation",74,22633491,"MaxQuant Score",97.6940000,1.0000000,,,,0.00088369997683913,0.1520000
YAANESWPLK,ng,N,336,true,"N-Glycopeptide Profiling in Arabidopsis Infloresce",132,27067053,"MOWSE score",22.4000000,,,,,0.00083999999333173,
KNPGTKFQQCPLLNISYCPASEAR,ng,N,470,true,"ER-associatied N-glycan degradation chilling stres",133,27558752,,,,,,,,
NPGTKFQQCPLLNISYCPASEAR,ng,N,470,true,"Conserved N-glycosylation",74,22633491,"MaxQuant Score",196.5900000,1.0000000,,,,0,1.5400000
IVQGPLFDE,nt,I,670,true,"Arg/N-end rule seed, prt6 vs. Wt",99,29168982,"MASCOT Score",68.2500000,,0.2038576,0.1469599,NO,0.00017319999460597,0.6152876
VQGPLFDE,nt,V,671,true,"Arg/N-end rule seed, prt6 vs. Wt",99,29168982,"MASCOT Score",51.8600000,,-0.1732953,0.1204289,NO,0.0081860003992915,-8.0779020
TNGTFYTDSNGRDFIKR,ng,N,730,true,"Conserved N-glycosylation",74,22633491,"MaxQuant Score",129.3400000,1.0000000,,,,1.3319999617178E-11,0.2370000
TNGTFYTDSNGR,ng,N,730,true,"N-glycan occupancy Arabidopsis glycoproteins",87,23994444,"Ladder score",71.0000000,,,,,,
TNGTFYTDSNGR,ng,N,730,true,"ER-associatied N-glycan degradation chilling stres",133,27558752,,,,,,,,
TNGTFYTDSNGR,ng,N,730,true,"UDP-GlcNAc transporter glycopeptide analysis",135,30224661,,,,,,,6.2945102399681E-5,-0.1000000
GVGEILNETVCLPEGCK,ng,N,820,true,"Conserved N-glycosylation",74,22633491,"MaxQuant Score",214.9400000,1.0000000,,,,0,-0.1740000
GVGEILNETVCLPEGCK,ng,N,820,true,"ER-associatied N-glycan degradation chilling stres",133,27558752,,,,,,,,
VEGSAGEEVKR,ac,K,977,true,"Quantitative Acetylproteomics",101,29440448,,,,,,,,
