Peptide,PTM,ModifiedAA,ModifiedPosition,PeptideUniqueToGene,ExperimentDesc,ExpID,PubmedID,ScoreType,IdentScore,LocProb,Log2FChange,PQ-val,QuantSig,PEP,MassErrorPPM
ATSGTYVTEVPLKGTAEKHFQR,nt,A,2,true,"FtsH12 N-terminome: WT / FtsH12 knockdown miRNA",118,33216923,"MaxQuant score",71.0300000,,,,,0.00017189000209328,
ATSGTYVTEVPLKG,nt,A,2,false,"Arg/N-end rule seed, prt6 vs. Wt",99,29168982,"MASCOT Score",37.0700000,,,,,0.021560000255704,2.3956944
ATSGTYVTEVPL,nt,A,2,false,"Arg/N-end rule seed, prt6 vs. Wt",99,29168982,"MASCOT Score",25.4700000,,,,,0.200100004673,-0.3949701
ATSGTYVTEV,nt,A,2,false,"N-term acetylation drought responses",5,26184543,,,,,,,,
ATSGTYVTE,nt,A,2,false,"Arg/N-end rule seed, prt6 vs. Wt",99,29168982,"MASCOT Score",37.1400000,,-0.0715613,0.5346199,NO,0.0096819996833801,-2.6195398
ATSGTYVTEVPLKG,nta,A,2,false,"Arg/N-end rule seed, prt6 vs. Wt",99,29168982,"MASCOT Score",37.0700000,,,,,0.021560000255704,2.3956944
ATSGTYVTEVPLK,nta,A,2,false,"Characterization plant N-terminal acetylation",6,22223895,"MASCOT Score",48.7200000,,,,,,
ATSGTYVTEVPL,nta,A,2,false,"Arg/N-end rule seed, prt6 vs. Wt",99,29168982,"MASCOT Score",25.4700000,,,,,0.200100004673,-0.3949701
ATSGTYVTEV,nta,A,2,false,"N-term acetylation drought responses",5,26184543,,,,,,,,
ITMIWEKR,ac,K,123,false,"Quantitative Acetylproteomics",101,29440448,,,,,,,,
