Peptide,PTM,ModifiedAA,ModifiedPosition,PeptideUniqueToGene,ExperimentDesc,ExpID,PubmedID,ScoreType,IdentScore,LocProb,Log2FChange,PQ-val,QuantSig,PEP,MassErrorPPM
IFSFPPAFLTRN,nta,I,54,true,"HUNTER N-terminome: legumain, GluC and trypsin",119,31951383,"MaxQuant score",72.0060000,,,,,,
IFSFPPAFLTR,nta,I,54,true,"Characterization plant N-terminal acetylation",6,22223895,"MASCOT Score",50.1200000,,,,,,
IFSFPPAFLTR,nta,I,54,true,"HUNTER N-terminome: legumain, GluC and trypsin",119,31951383,"MaxQuant score",111.0600000,,,,,,
GATASPDDQLR,ph,S,92,true,"Tissue atlas Arabidopsis - ProteomicsDB",114,32188942,"MaxQuant score",91.2330000,0.9997610,,,,0.00034869700903073,
KVEAVNPTKEPLK,ac,K,113,false,"Histone deacetylases substrates - hda14 vs WT",98e,29061669,"MaxQuant Score",49.3000000,1.0000000,-0.0230000,0.9727472,NO,0.0040000001899898,
EPLKSDLVNGK,ac,K,117,true,"Quantitative Acetylproteomics",101,29440448,,,,,,,,
SITNYQSINVDTLK,ph,T,148,true,"Tissue atlas Arabidopsis - ProteomicsDB",114,32188942,"MaxQuant score",217.3900000,0.9999470,,,,0,
GDKGNLFILK,ac,K,225,true,"Histone deacetylases - apicidin vs control",98a,29061669,"MaxQuant Score",154.0000000,1.0000000,0.0230000,0.8871560,NO,2.4000000076106E-29,
GDKGNLFILK,ac,K,225,true,"Histone deacetylases substrates - TSA vs control",98b,29061669,"MaxQuant Score",154.0000000,1.0000000,-0.0640000,0.9977001,NO,2.4000000076106E-29,
GDKGNLFILK,ac,K,225,true,"Histone deacetylases- hda14 vs WT (low light)",98c,29061669,"MaxQuant Score",147.6200000,1.0000000,-0.2670000,0.9885531,NO,0.00089000002481043,
GDKGNLFILK,ac,K,225,true,"Histone deacetylases - hda14 vs WT (thylakoids)",98d,29061669,"MaxQuant Score",150.5000000,1.0000000,-0.0550000,0.9862795,NO,6.4500000895862E-9,
GDKGNLFILK,ac,K,225,true,"Histone deacetylases substrates - hda14 vs WT",98e,29061669,"MaxQuant Score",108.7000000,1.0000000,0.0380000,0.9705100,NO,2.7000000457633E-8,
GDKGNLFILK,ac,K,225,true,"Quantitative Acetylproteomics",101,29440448,,,,,,,,
