Peptide,PTM,ModifiedAA,ModifiedPosition,PeptideUniqueToGene,ExperimentDesc,ExpID,PubmedID,ScoreType,IdentScore,LocProb,Log2FChange,PQ-val,QuantSig,PEP,MassErrorPPM
IREIFMPALSSTMTEGK,mox,M,60,false,"cat2 Methionine oxidation - 3h stress",62b,25693801,"MASCOT Score",38.0000000,,0.1603145,,NO,,
IREIFMPALSSTMTEGK,mox,M,67,false,"cat2 Methionine oxidation - 3h stress",62b,25693801,"MASCOT Score",38.0000000,,0.1603145,,NO,,
EIFMPALSSTMTEGKIVSWIK,ac,K,71,true,"Histone deacetylases- hda14 vs WT (low light)",98c,29061669,"MaxQuant Score",191.6500000,1.0000000,2.2840000,0.8892011,NO,1.3999999814211E-18,
EIFMPALSSTMTEGKIVSWIK,ac,K,71,true,"Histone deacetylases - hda14 vs WT (thylakoids)",98d,29061669,"MaxQuant Score",74.0000000,1.0000000,1.5240000,0.2233572,NO,4.23999990673E-9,
IVSWIKTEGEK,ac,K,77,true,"Quantitative Acetylproteomics",101,29440448,,,,,,,,
TEGEKLAK,ac,K,82,true,"Histone deacetylases - apicidin vs control",98a,29061669,"MaxQuant Score",128.9000000,1.0000000,-0.1900000,0.3499452,NO,0.0020000000949949,
TEGEKLAK,ac,K,82,true,"Histone deacetylases- hda14 vs WT (low light)",98c,29061669,"MaxQuant Score",141.0200000,1.0000000,0.6680000,0.6934258,NO,0.023000000044703,
TEGEKLAK,ac,K,82,true,"Histone deacetylases substrates - hda14 vs WT",98e,29061669,"MaxQuant Score",118.7000000,1.0000000,0.7500000,0.0722770,NO,1.399999973728E-7,
QHKVDIESVAGTGPFGR,ac,K,200,true,"Quantitative Acetylproteomics",101,29440448,,,,,,,,
SVAGTGPFGRITASDVE,nt,S,205,true,"N-terminal ChaFRADIC",92,26010716,"MASCOT Score",34.9400000,,,,,1.0210000027655E-6,
ITASDVETAAGIAPSK,ph,T,222,true,"SIRK1 phosphorylation",86a,23820729,"MaxQuant Score",66.1370000,0.9770000,,,,1.1449999809265,4.9450000
ITASDVETAAGIAPSK,ph,T,222,true,"SIRK1 exp - sirk1 mutant vs WT",86b,23820729,,,,-1.1758362,,NO,,
ITASDVETAAGIAPSK,ph,T,222,true,"SIRK1 exp - 35S:SIRK1 vs WT",86c,23820729,,,,1.5445076,,NO,,
ITASDVETAAGIAPSK,ph,S,229,true,"SIRK1 phosphorylation",86a,23820729,"MaxQuant Score",66.1370000,0.9590000,,,,1.1449999809265,4.9450000
ITASDVETAAGIAPSK,ph,S,229,true,"SIRK1 exp - sirk1 mutant vs WT",86b,23820729,,,,-1.1758362,,NO,,
ITASDVETAAGIAPSK,ph,S,229,true,"SIRK1 exp - 35S:SIRK1 vs WT",86c,23820729,,,,1.5445076,,NO,,
VGYPVNTDALDALYEKVKPK,ac,K,301,true,"Histone deacetylases - apicidin vs control",98a,29061669,"MaxQuant Score",205.7000000,0.9820000,0.0900000,0.6745280,NO,0,
VGYPVNTDALDALYEKVKPK,ac,K,301,true,"Histone deacetylases - hda14 vs WT (thylakoids)",98d,29061669,"MaxQuant Score",132.7000000,0.9690000,-0.1550000,0.8892011,NO,1.1199999644574E-20,
VGYPVNTDALDALYEKVKPK,ac,K,301,true,"Histone deacetylases substrates - hda14 vs WT",98e,29061669,"MaxQuant Score",236.0000000,0.9830000,0.2140000,0.8709636,NO,0,
GVTMTALLAK,mox,M,309,false,"cat2 Methionine oxidation - 1h stress",62a,25693801,"MASCOT Score",34.0000000,,0.6748115,,NO,,
GVTMTALLAK,ph,T,310,false,"Tissue atlas Arabidopsis - ProteomicsDB",114,32188942,"MaxQuant score",141.8900000,0.9949880,,,,4.5126098484616E-6,
AAGMALAQHPVVNASCK,ox,C,331,true,"SPEAR - 10 mM H2O2 / mock",138a,34619326,,,,1.6857584,0.0288002,YES,,
AAGMALAQHPVVNASCK,sno,C,331,true,"Site-specific nitrosomeproteomic id - gsnor1-3",90a,25699590,XCorr,3.0200000,,,,,0.0093099996447563,-5.7700000
AAGMALAQHPVVNASCK,sno,C,331,true,"Site-specific nitrosomeproteomic id - gsnor1-3",90b,25699590,XCorr,3.8600000,,,,,2.5470000764471E-5,-7.4900000
AAGMALAQHPVVNASCK,so,C,331,true,"Arabidopsis S-sulfenylation chemoproteomics",108,31578252,"pFind PSM Score",0.0000034,,0.8111600,,,,0.8150141
AAGMALAQHPVVNASCK,so,C,331,true,"S-sulfenylation site detection using YAP1C",110,32714340,,,,,,,,
ELVGKAR,ac,K,381,true,"Quantitative Acetylproteomics",101,29440448,,,,,,,,
