Peptide,PTM,ModifiedAA,ModifiedPosition,PeptideUniqueToGene,ExperimentDesc,ExpID,PubmedID,ScoreType,IdentScore,LocProb,Log2FChange,PQ-val,QuantSig,PEP,MassErrorPPM
TADSDGESGEIKFEDNNLPPLGEK,ph,S,105,true,"srk2dei ABA signaling phopshoproteomics",83,23572148,"MASCOT Score",38.0000000,,,,,,-0.0005000
TADSDGESGEIKFEDNNLPPLGEK,ph,S,105,true,"LAXIC - mannitol vs control",84b,23660473,XCorr,3.4700000,0.7500000,,,,6.400000074791E-6,
TADSDGESGEIKFEDNNLPPLGEK,ph,S,105,true,"Brassinosteroid-Regulated Phosphorylation Dynamics",94,26187819,"MaxQuant Score",84.7410000,0.9550000,,,,0.0010000000474975,1.1670000
TADSDGESGEIKFEDNNLPPLGEK,ph,S,105,true,"Phospho cell culture sucrose/TOR",109,30833711,,,0.9844750,,,,,
TADSDGESGEIKFEDNNLPPLGEK,ph,S,105,true,"Tissue atlas Arabidopsis - ProteomicsDB",114,32188942,"MaxQuant score",286.9600000,1.0000000,,,,0,
TADSDGESGEIK,ph,S,105,true,"atm and atr DNA damage response",88,25561503,"MASCOT Score",58.0000000,0.9970000,,,,,0.3400000
TADSDGESGEIK,ph,S,105,true,"TOR Kinase and ABA Receptor",100,29290610,XCorr,3.1563652,0.9985000,,,,0.0010529999854043,
TADSDGESGEIKFEDNNLPPLGEK,ph,S,109,true,"Large-scale phosphorylation discovery",44,23111157,XCorr,3.8760000,,,,,,
TADSDGESGEIKFEDNNLPPLGEK,ph,S,109,true,"srk2dei ABA signaling phopshoproteomics",83,23572148,"MASCOT Score",38.0000000,,,,,,-0.0005000
TADSDGESGEIKFEDNNLPPLGEK,ph,S,109,true,"LAXIC - mannitol vs control",84b,23660473,XCorr,3.4700000,0.8920000,,,,6.400000074791E-6,
TADSDGESGEIKFEDNNLPPLGEK,ph,S,109,true,"SnRK2 protein kinase substrates",85,23776212,XCorr,3.3652048,0.9420000,,,,3.9887100566904E-11,
TADSDGESGEIKFEDNNLPPLGEK,ph,S,109,true,"Brassinosteroid-Regulated Phosphorylation Dynamics",94,26187819,"MaxQuant Score",84.7410000,0.9990000,,,,0.0010000000474975,2.4400000
TADSDGESGEIKFEDNNLPPLGEK,ph,S,109,true,"Phospho cell culture sucrose/TOR",109,30833711,,,0.9987190,,,,,
TADSDGESGEIKFEDNNLPPLGEK,ph,S,109,true,"Tissue atlas Arabidopsis - ProteomicsDB",114,32188942,"MaxQuant score",286.9600000,1.0000000,,,,0,
TADSDGESGEIK,ph,S,109,true,"atm and atr DNA damage response",88,25561503,"MASCOT Score",46.0000000,1.0000000,,,,,-0.6500000
LSYDNGRSSFSPSNSR,ph,S,171,true,"atm and atr DNA damage response",88,25561503,"MASCOT Score",36.0000000,0.9920000,,,,,-0.5100000
LSYDNGRSSFSPSNSR,ph,S,171,true,"Tissue atlas Arabidopsis - ProteomicsDB",114,32188942,"MaxQuant score",129.0300000,0.9112140,,,,7.2670502504479E-8,
SSFSPSNSR,ph,S,171,true,"atm and atr DNA damage response",88,25561503,"MASCOT Score",30.0000000,0.9460000,,,,,-0.9600000
LSYDNGRSSFSPSNSR,ph,S,173,true,"atm and atr DNA damage response",88,25561503,"MASCOT Score",36.0000000,0.9910000,,,,,-0.5100000
SSFSPSNSRQSNEGR,ph,S,173,true,"atm and atr DNA damage response",88,25561503,"MASCOT Score",21.0000000,1.0000000,,,,,0.8000000
SSFSPSNSR,ph,S,173,true,"atm and atr DNA damage response",88,25561503,"MASCOT Score",38.0000000,0.9950000,,,,,-0.7000000
SSFSPSNSR,ph,S,173,true,"Tissue atlas Arabidopsis - ProteomicsDB",114,32188942,"MaxQuant score",150.1000000,0.9999940,,,,7.2670502504479E-8,
LSYDNGRSSFSPSNSR,ph,S,175,true,"Tissue atlas Arabidopsis - ProteomicsDB",114,32188942,"MaxQuant score",71.9290000,0.8153690,,,,0.00010600699897623,
SSFSPSNSRQSNEGR,ph,S,180,true,"atm and atr DNA damage response",88,25561503,"MASCOT Score",21.0000000,1.0000000,,,,,0.8000000
FAEDEFSDRGR,ph,S,209,true,"atm and atr DNA damage response",88,25561503,"MASCOT Score",40.0000000,1.0000000,,,,,0.1100000
FAEDEFSDRGR,ph,S,209,true,"Phospho cell culture sucrose/TOR",109,30833711,,,1.0000000,,,,,
FAEDEFSDRGR,ph,S,209,true,"Tissue atlas Arabidopsis - ProteomicsDB",114,32188942,"MaxQuant score",182.9300000,1.0000000,,,,7.2540899509477E-7,
FAEDEFSDR,ph,S,209,true,"STN8 phosphoproteome",38,21768351,"MASCOT Score",37.4600000,,,,,,-1.0183400
FAEDEFSDR,ph,S,209,true,"atm and atr DNA damage response",88,25561503,"MASCOT Score",37.0000000,1.0000000,,,,,0.3300000
DMDREGSIRDR,ph,S,268,true,"Tissue atlas Arabidopsis - ProteomicsDB",114,32188942,"MaxQuant score",55.1860000,1.0000000,,,,0.0061575002036989,
ERSIDRDR,ph,S,313,true,"Tissue atlas Arabidopsis - ProteomicsDB",114,32188942,"MaxQuant score",75.4740000,1.0000000,,,,0.0036974200047553,
YISSDVDYGEMR,ph,S,376,true,"Phospho cell culture sucrose/TOR",109,30833711,,,0.9398890,,,,,
YISSDVDYGEMR,ph,S,376,true,"Tissue atlas Arabidopsis - ProteomicsDB",114,32188942,"MaxQuant score",97.6310000,0.9861380,,,,4.4808799430029E-5,
GDKLEETWANDERSR,ph,S,427,true,"Tissue atlas Arabidopsis - ProteomicsDB",114,32188942,"MaxQuant score",66.4670000,0.9790620,,,,0.00029417898622341,
SRNEDGQDDNDEGLTWKSPEEEEEELLNR,ph,S,444,true,"Tissue atlas Arabidopsis - ProteomicsDB",114,32188942,"MaxQuant score",126.6300000,0.9989610,,,,6.0255833965967E-43,
DIVPETGAPVSTSPAVVIAANVGQAK,ph,S,499,true,"Large-scale phosphorylation discovery",44,23111157,XCorr,4.9950000,,,,,,
DIVPETGAPVSTSPAVVIAANVGQAK,ph,T,500,true,"Tissue atlas Arabidopsis - ProteomicsDB",114,32188942,"MaxQuant score",193.7100000,0.7641570,,,,0,
KPEQQNELLTQDNGKDIVPETGAPVSTSPAVVIAANVGQAK,ph,S,501,true,"Tissue atlas Arabidopsis - ProteomicsDB",114,32188942,"MaxQuant score",281.9100000,0.9937730,,,,0,
DIVPETGAPVSTSPAVVIAANVGQAK,ph,S,501,true,"Large-scale phosphorylation discovery",44,23111157,XCorr,4.6680000,,,,,,
DIVPETGAPVSTSPAVVIAANVGQAK,ph,S,501,true,"TOR Kinase and ABA Receptor",100,29290610,XCorr,5.5528331,0.8726000,,,,1.1940000099742E-9,
APLIAGGPPTMSGISDSEK,ph,T,535,true,"Lateral root-induction - NAA vs control",106,23328941,"MASCOT Score",32.0000000,,,,,,
APLIAGGPPTMSGISDSEK,ph,S,537,true,"TOR Kinase and ABA Receptor",100,29290610,XCorr,5.1347737,0.8967000,,,,1.6710000494413E-8,
APLIAGGPPTMSGISDSEK,ph,S,537,true,"Tissue atlas Arabidopsis - ProteomicsDB",114,32188942,"MaxQuant score",129.8900000,0.9037530,,,,6.7010000419896E-15,
APLIAGGPPTMSGISDSEK,ph,S,540,true,"srk2dei ABA signaling phopshoproteomics",83,23572148,"MASCOT Score",29.0000000,,,,,,-0.0008000
APLIAGGPPTMSGISDSEK,ph,S,540,true,"SnRK2 protein kinase substrates",85,23776212,XCorr,4.1037574,0.9990000,,,,9.4984498044681E-10,
APLIAGGPPTMSGISDSEK,ph,S,540,true,"atm and atr DNA damage response",88,25561503,"MASCOT Score",75.0000000,0.9570000,,,,,0.4300000
APLIAGGPPTMSGISDSEK,ph,S,540,true,"TOR Kinase and ABA Receptor",100,29290610,XCorr,5.4263525,0.9101000,,,,1.8819999378361E-11,
APLIAGGPPTMSGISDSEK,ph,S,540,true,"Tissue atlas Arabidopsis - ProteomicsDB",114,32188942,"MaxQuant score",304.3400000,0.9947570,,,,0,
APLIAGGPPTMSGISDSEK,ph,S,542,true,"srk2dei ABA signaling phopshoproteomics",83,23572148,"MASCOT Score",43.0000000,,,,,,-0.0014000
APLIAGGPPTMSGISDSEK,ph,S,542,true,"Tissue atlas Arabidopsis - ProteomicsDB",114,32188942,"MaxQuant score",194.8700000,0.7543290,,,,0,
NQAQAGLGEGSPKSER,ph,S,555,true,"LAXIC - mannitol vs control",84b,23660473,XCorr,5.1500000,1.0000000,,,,7.1800001023803E-5,
NQAQAGLGEGSPKSER,ph,S,555,true,"Phospho cell culture sucrose/TOR",109,30833711,,,1.0000000,,,,,
NQAQAGLGEGSPKSER,ph,S,555,true,"Tissue atlas Arabidopsis - ProteomicsDB",114,32188942,"MaxQuant score",209.2600000,1.0000000,,,,0,
NQAQAGLGEGSPK,ph,S,555,true,"STN8 phosphoproteome",38,21768351,"MASCOT Score",96.5700000,,,,,,-1.0589000
NQAQAGLGEGSPK,ph,S,555,true,"Chloroplast kinase substrates",60,19376835,"MASCOT Score",87.4500000,,,,,,-1.5523200
NQAQAGLGEGSPK,ph,S,555,true,"SnRK2 protein kinase substrates",85,23776212,XCorr,2.3963695,1.0000000,,,,0.0025203099939972,
NQAQAGLGEGSPK,ph,S,555,true,"atm and atr DNA damage response",88,25561503,"MASCOT Score",89.0000000,1.0000000,,,,,-0.4300000
NQAQAGLGEGSPK,ph,S,555,true,"TOR Kinase and ABA Receptor",100,29290610,XCorr,4.6309242,1.0000000,,,,9.7800002549775E-6,
NQAQAGLGEGSPK,ph,S,555,true,"Lateral root-induction - NAA vs control",106,23328941,"MASCOT Score",31.0000000,,,,,,
SERSADMFHDDIFGESPAGIRK,ph,S,558,true,"TOR Kinase and ABA Receptor",100,29290610,XCorr,4.2190189,0.8622000,,,,0.039500001817942,
NQAQAGLGEGSPKSER,ph,S,558,true,"LAXIC - mannitol vs control",84b,23660473,XCorr,5.1500000,1.0000000,,,,7.1800001023803E-5,
NQAQAGLGEGSPKSER,ph,S,558,true,"Tissue atlas Arabidopsis - ProteomicsDB",114,32188942,"MaxQuant score",209.2600000,1.0000000,,,,0,
SADMFHDDIFGESPAGIRK,ph,S,561,true,"STN8 phosphoproteome",38,21768351,"MASCOT Score",51.0200000,,,,,,
SADMFHDDIFGESPAGIRK,ph,S,561,true,"Chloroplast kinase substrates",60,19376835,"MASCOT Score",43.5700000,,,,,,-0.6754600
SADMFHDDIFGESPAGIRK,ph,S,561,true,"srk2dei ABA signaling phopshoproteomics",83,23572148,"MASCOT Score",33.0000000,,,,,,0.0005000
SADMFHDDIFGESPAGIRK,ph,S,561,true,"Phospho cell culture sucrose/TOR",109,30833711,,,1.0000000,,,,,
SADMFHDDIFGESPAGIRK,ph,S,561,true,"Tissue atlas Arabidopsis - ProteomicsDB",114,32188942,"MaxQuant score",256.2000000,1.0000000,,,,0,
SERSADMFHDDIFGESPAGIRK,ph,S,573,true,"TOR Kinase and ABA Receptor",100,29290610,XCorr,4.2190189,1.0000000,,,,0.039500001817942,
SADMFHDDIFGESPAGIRK,ph,S,573,true,"Chloroplast kinase substrates",60,19376835,"MASCOT Score",43.5700000,,,,,,-0.6754600
SADMFHDDIFGESPAGIRK,ph,S,573,true,"srk2dei ABA signaling phopshoproteomics",83,23572148,"MASCOT Score",33.0000000,,,,,,0.0005000
SADMFHDDIFGESPAGIRK,ph,S,573,true,"TOR Kinase and ABA Receptor",100,29290610,XCorr,5.1176300,1.0000000,,,,1.1550000067473E-7,
SADMFHDDIFGESPAGIRK,ph,S,573,true,"Tissue atlas Arabidopsis - ProteomicsDB",114,32188942,"MaxQuant score",270.4900000,1.0000000,,,,0,
SADMFHDDIFGESPAGIR,ph,S,573,true,"SnRK2 protein kinase substrates",85,23776212,XCorr,2.9159250,1.0000000,,,,0.024256499484181,
LCDFGNAMFAGKNEVTPYLVSR,ph,Y,782,true,"Tyrosine phosphorylation - flg22 vs mock",105,22074104,"MASCOT Score",103.1600000,,,,,,-3.0991129
NEVTPYLVSR,ph,Y,782,false,"Arabidopsis root NAA phosphoproteome",18a,27643528,"MaxQuant Score",79.6590000,0.9200000,,,,0.0003564000071492,0.2190000
NEVTPYLVSR,ph,Y,782,false,"Tyrosine phosphorylation in Arabidopsis",59,18463617,"MASCOT Score",36.0000000,,,,,,-0.7162302
NEVTPYLVSR,ph,Y,782,false,"srk2dei ABA signaling phopshoproteomics",83,23572148,"MASCOT Score",52.0000000,,,,,,0.0002000
NEVTPYLVSR,ph,Y,782,false,"SnRK2 protein kinase substrates",85,23776212,XCorr,2.0899632,0.9990000,,,,0.01291530020535,
NEVTPYLVSR,ph,Y,782,false,"atm and atr DNA damage response",88,25561503,"MASCOT Score",40.0000000,1.0000000,,,,,0.0100000
NEVTPYLVSR,ph,Y,782,false,"Brassinosteroid-Regulated Phosphorylation Dynamics",94,26187819,"MaxQuant Score",136.5000000,0.9980000,,,,5.0329999794485E-6,1.6660000
NEVTPYLVSR,ph,Y,782,false,"Tyrosine phosphorylation - flg22 vs mock",105,22074104,"MASCOT Score",51.3000000,,0.0500000,,YES,,
NEVTPYLVSR,ph,Y,782,false,"Lateral root-induction - NAA vs control",106,23328941,"MASCOT Score",23.0000000,,,,,,
NEVTPYLVSR,ph,Y,782,false,"Col-0 callus - FC Col-0 vs. Col-0 Xray",111a,31410901,,47.8900000,,0.0101385,0.0000000,NO,,0.2756523
NEVTPYLVSR,ph,Y,782,false,"Col-0 X-ray callus - FC Col-0 vs. Col-0 Xray",111b,31410901,,47.8900000,,0.0101385,0.0000000,NO,,0.2756523
NEVTPYLVSR,ph,Y,782,false,"atm callus - FC atm vs. atm Xray",111c,31410901,,47.8900000,,0.2936239,0.0000000,NO,,0.2756523
NEVTPYLVSR,ph,Y,782,false,"atm-3 X-ray callus - FC atm vs. atm Xray",111d,31410901,,47.8900000,,0.2936239,0.0000000,NO,,0.2756523
NEVTPYLVSR,ph,Y,782,false,"Tissue atlas Arabidopsis - ProteomicsDB",114,32188942,"MaxQuant score",185.6000000,0.9842790,,,,2.1638499880794E-9,
NEVTPYLVSR,ph,S,785,false,"Tyrosine phosphorylation in Arabidopsis",59,18463617,"MASCOT Score",37.0000000,,,,,,-0.3183244
NEVTPYLVSR,ph,S,785,false,"srk2dei ABA signaling phopshoproteomics",83,23572148,"MASCOT Score",39.0000000,,,,,,-0.0004000
NEVTPYLVSR,ph,S,785,false,"Brassinosteroid-Regulated Phosphorylation Dynamics",94,26187819,"MaxQuant Score",130.5600000,0.8350000,,,,0.003000000026077,1.1520000
NEVTPYLVSR,ph,S,785,false,"Tyrosine phosphorylation - flg22 vs mock",105,22074104,"MASCOT Score",51.3100000,,,,,,1.0389294
NEVTPYLVSR,ph,S,785,false,"Lateral root-induction - NAA vs control",106,23328941,"MASCOT Score",27.0000000,,,,,,
NEVTPYLVSR,ph,S,785,false,"Phospho cell culture sucrose/TOR",109,30833711,,,0.8637350,,,,,
NEVTPYLVSR,ph,S,785,false,"Tissue atlas Arabidopsis - ProteomicsDB",114,32188942,"MaxQuant score",172.2100000,0.9694930,,,,1.3101400497817E-7,
