Peptide,PTM,ModifiedAA,ModifiedPosition,PeptideUniqueToGene,ExperimentDesc,ExpID,PubmedID,ScoreType,IdentScore,LocProb,Log2FChange,PQ-val,QuantSig,PEP,MassErrorPPM
NQDLNFSDDSK,ph,S,143,true,"Tissue atlas Arabidopsis - ProteomicsDB",114,32188942,"MaxQuant score",123.9200000,1.0000000,,,,1.3365300219448E-5,
NQDLNFSDDSK,ph,S,146,true,"Tissue atlas Arabidopsis - ProteomicsDB",114,32188942,"MaxQuant score",123.9200000,1.0000000,,,,1.3365300219448E-5,
NQDLNFSDDSKTYTTDSSR,ub,K,147,true,"upl3 mutant / wildtype",168,35926874,"MaxQuant score",125.7300000,1.0000000,-0.2515388,0.7780600,NO,2.3628801281046E-13,0.8034800
GIDEQSLSNNGSSSR,ph,S,208,true,"Tissue atlas Arabidopsis - ProteomicsDB",114,32188942,"MaxQuant score",77.0510000,0.9941020,,,,0.00031147999106906,
GIDEQSLSNNGSSSR,ph,S,215,true,"Tissue atlas Arabidopsis - ProteomicsDB",114,32188942,"MaxQuant score",311.0900000,0.8851230,,,,0,
GIDEQSLSNNGSSSR,ph,S,216,true,"Phosphorylation Early Elicitor Signaling",23,17317660,,,,,,,,
KLESPDLQPLPPLMKR,ph,S,221,true,"Chloroplast kinase substrates",60,19376835,"MASCOT Score",36.1700000,,,,,,-0.3591340
KLESPDLQPLPPLMK,ph,S,221,true,"Phosphorylation Early Elicitor Signaling",23,17317660,,,,,,,,
KLESPDLQPLPPLMK,ph,S,221,true,"TOR Kinase and ABA Receptor",100,29290610,XCorr,3.2233591,1.0000000,,,,0.018840000033379,
KLESPDLQPLPPLMK,ph,S,221,true,"Tissue atlas Arabidopsis - ProteomicsDB",114,32188942,"MaxQuant score",228.0800000,1.0000000,,,,0,
LNPDVGSIGEEDEEDEFYSPR,ph,S,255,true,"Phosphorylation Early Elicitor Signaling",23,17317660,,,,,,,,
LNPDVGSIGEEDEEDEFYSPR,ph,S,255,true,"Phytohormone-responsive phosphoproteins",34,20374526,"MASCOT Score",76.0000000,,,,,,4.0680300
LNPDVGSIGEEDEEDEFYSPR,ph,S,255,true,"Large-scale phosphorylation discovery",44,23111157,XCorr,6.3280000,,,,,,
LNPDVGSIGEEDEEDEFYSPR,ph,S,255,true,"SnRK2 protein kinase substrates",85,23776212,XCorr,3.5540597,0.9660000,,,,0.0040852599777281,
LNPDVGSIGEEDEEDEFYSPR,ph,S,255,true,"TOR Kinase and ABA Receptor",100,29290610,XCorr,4.0790505,0.9798000,,,,5.1520000852179E-6,
LNPDVGSIGEEDEEDEFYSPR,ph,S,255,true,"Tissue atlas Arabidopsis - ProteomicsDB",114,32188942,"MaxQuant score",232.8200000,1.0000000,,,,0,
LNPDVGSIGEEDEEDEFYSPRGSQSGREPLNR,ph,S,259,true,"TOR Kinase and ABA Receptor",100,29290610,XCorr,4.0660782,0.7752000,,,,0.0024079999420792,
GSQSGREPLNR,ph,S,259,true,"atm and atr DNA damage response",88,25561503,"MASCOT Score",20.0000000,0.9930000,,,,,-0.1600000
GSQSGREPLNR,ph,S,259,true,"Tissue atlas Arabidopsis - ProteomicsDB",114,32188942,"MaxQuant score",164.7200000,0.9947940,,,,0,
GSQSGREPLNR,ph,S,261,true,"atm and atr DNA damage response",88,25561503,"MASCOT Score",31.0000000,1.0000000,,,,,0.5100000
GSQSGREPLNR,ph,S,261,true,"Tissue atlas Arabidopsis - ProteomicsDB",114,32188942,"MaxQuant score",99.3110000,0.9979000,,,,1.0916400084936E-21,
SVNNDTISCSSSSSGSPGR,ph,S,293,true,"Tissue atlas Arabidopsis - ProteomicsDB",114,32188942,"MaxQuant score",202.5200000,0.9660630,,,,0,
STFISISPSMSPK,ph,S,301,true,"atm and atr DNA damage response",88,25561503,"MASCOT Score",34.0000000,1.0000000,,,,,0.2000000
STFISISPSMSPK,ph,S,301,true,"Tissue atlas Arabidopsis - ProteomicsDB",114,32188942,"MaxQuant score",148.7000000,0.9809200,,,,6.3839399899734E-7,
STFISISPSMSPK,ph,S,303,true,"Plasmamembrane phosphorylation",20,15308754,,,,,,,,
STFISISPSMSPK,ph,S,303,true,"Phytohormone-responsive phosphoproteins",34,20374526,"MASCOT Score",43.0000000,,,,,,
STFISISPSMSPK,ph,S,303,true,"Conserved plant phosphoproteome - Arabidopsis",61a,20466843,"MASCOT Score",28.0000000,1.0000000,,,,,
STFISISPSMSPK,ph,S,303,true,"SnRK2 protein kinase substrates",85,23776212,XCorr,2.0722187,0.9950000,,,,0.00015986899961717,
STFISISPSMSPK,ph,S,303,true,"atm and atr DNA damage response",88,25561503,"MASCOT Score",43.0000000,1.0000000,,,,,-1.3500000
STFISISPSMSPK,ph,S,303,true,"TOR Kinase and ABA Receptor",100,29290610,XCorr,3.5162053,0.9350000,,,,0.0040779998525977,
STFISISPSMSPK,ph,S,303,true,"Tissue atlas Arabidopsis - ProteomicsDB",114,32188942,"MaxQuant score",164.6600000,0.9939390,,,,7.2935400774465E-11,
STFISISPSMSPKR,ph,S,305,true,"atm and atr DNA damage response",88,25561503,"MASCOT Score",42.0000000,1.0000000,,,,,-0.1200000
STFISISPSMSPK,ph,S,305,true,"Conserved plant phosphoproteome - Arabidopsis",61a,20466843,"MASCOT Score",63.0000000,1.0000000,,,,,
STFISISPSMSPK,ph,S,305,true,"Tissue atlas Arabidopsis - ProteomicsDB",114,32188942,"MaxQuant score",130.7200000,0.8204770,,,,1.798880049364E-7,
STFISISPSMSPKR,ph,S,307,true,"atm and atr DNA damage response",88,25561503,"MASCOT Score",42.0000000,1.0000000,,,,,-0.1200000
STFISISPSMSPK,ph,S,307,true,"Conserved plant phosphoproteome - Arabidopsis",61a,20466843,"MASCOT Score",63.0000000,1.0000000,,,,,
STFISISPSMSPK,ph,S,307,true,"SnRK2 protein kinase substrates",85,23776212,XCorr,2.0722187,0.9950000,,,,0.00015986899961717,
STFISISPSMSPK,ph,S,307,true,"atm and atr DNA damage response",88,25561503,"MASCOT Score",43.0000000,1.0000000,,,,,-1.3500000
STFISISPSMSPK,ph,S,307,true,"TOR Kinase and ABA Receptor",100,29290610,XCorr,3.5162053,0.9950000,,,,0.0040779998525977,
STFISISPSMSPK,ph,S,307,true,"Tissue atlas Arabidopsis - ProteomicsDB",114,32188942,"MaxQuant score",164.6600000,0.9879860,,,,7.2935400774465E-11,
RSEPKPPVISTPEPAELTDYR,ph,T,320,true,"Tissue atlas Arabidopsis - ProteomicsDB",114,32188942,"MaxQuant score",106.6000000,0.9530120,,,,1.1377800090973E-10,
FVRSPSLSLASLSSGLK,ph,S,334,true,"Phosphorylation Early Elicitor Signaling",23,17317660,,,,,,,,
FVRSPSLSLASLSSGLK,ph,S,334,true,"TOR Kinase and ABA Receptor",100,29290610,XCorr,4.8894811,0.8866000,,,,1.0349999683967E-6,
FVRSPSLSLASLSSGLK,ph,S,334,true,"Tissue atlas Arabidopsis - ProteomicsDB",114,32188942,"MaxQuant score",186.7400000,0.9848870,,,,6.4275602282624E-30,
SPSLSLASLSSGLK,ph,S,334,true,"atm and atr DNA damage response",88,25561503,"MASCOT Score",84.0000000,1.0000000,,,,,-0.1800000
SPSLSLASLSSGLK,ph,S,334,true,"TOR Kinase and ABA Receptor",100,29290610,XCorr,3.8880887,0.8484000,,,,0.00027600000612438,
SPSLSLASLSSGLK,ph,S,336,true,"Phosphorylation Early Elicitor Signaling",23,17317660,,,,,,,,
SPSLSLASLSSGLK,ph,S,336,true,"Plasmembrane Ph Immune Responses",25,17651370,,,,,,,,
SPSLSLASLSSGLK,ph,S,336,true,"Large-scale phosphorylation discovery",44,23111157,XCorr,4.3580000,,,,,,
SPSLSLASLSSGLK,ph,S,336,true,"atm and atr DNA damage response",88,25561503,"MASCOT Score",26.0000000,0.9450000,,,,,0.5600000
SPSLSLASLSSGLK,ph,S,336,true,"Tissue atlas Arabidopsis - ProteomicsDB",114,32188942,"MaxQuant score",51.4950000,0.8730430,,,,0.00083972897846252,
SPSLSLASLSSGLK,ph,S,341,true,"atm and atr DNA damage response",88,25561503,"MASCOT Score",29.0000000,0.9860000,,,,,-0.5900000
NSDEVGLNQIFR,ph,S,349,true,"Phosphorylation Early Elicitor Signaling",23,17317660,,,,,,,,
SPTVTSLTTSPENNKK,ph,T,362,true,"Tissue atlas Arabidopsis - ProteomicsDB",114,32188942,"MaxQuant score",180.1100000,0.9999610,,,,4.9157001410744E-26,
SPTVTSLTTSPENNKK,ph,S,365,true,"Phosphorylation Early Elicitor Signaling",23,17317660,,,,,,,,
SPTVTSLTTSPENNKK,ph,S,365,true,"Tissue atlas Arabidopsis - ProteomicsDB",114,32188942,"MaxQuant score",175.4300000,0.9514050,,,,3.2138200185339E-19,
SPTVTSLTTSPENNKK,ph,T,368,true,"Phosphorylation Early Elicitor Signaling",23,17317660,,,,,,,,
SPTVTSLTTSPENNKK,ph,S,369,true,"Tissue atlas Arabidopsis - ProteomicsDB",114,32188942,"MaxQuant score",191.1300000,0.9187890,,,,1.3601799818779E-35,
SPTVTSLTTSPENNK,ph,S,369,true,"Phosphorylation Early Elicitor Signaling",23,17317660,,,,,,,,
RPNDTPEAYLR,ph,T,394,true,"Tissue atlas Arabidopsis - ProteomicsDB",114,32188942,"MaxQuant score",113.5200000,1.0000000,,,,7.3404698923696E-5,
SPSHSSASTSPYR,ph,S,401,true,"Tissue atlas Arabidopsis - ProteomicsDB",114,32188942,"MaxQuant score",93.3480000,0.9834190,,,,0.00031462201150134,
SPSHSSASTSPYR,ph,S,403,true,"TOR Kinase and ABA Receptor",100,29290610,XCorr,2.6765187,0.9102000,,,,0.0034399998839945,
SPSHSSASTSPYR,ph,S,403,true,"Tissue atlas Arabidopsis - ProteomicsDB",114,32188942,"MaxQuant score",84.2970000,0.9902280,,,,0.00057232601102442,
CFQKSPEVLPAFMSNLR,ph,S,418,true,"Phosphorylation Early Elicitor Signaling",23,17317660,,,,,,,,
SPEVLPAFMSNLR,ph,S,418,true,"atm and atr DNA damage response",88,25561503,"MASCOT Score",25.0000000,1.0000000,,,,,-0.2300000
SPEVLPAFMSNLR,ph,S,418,true,"TOR Kinase and ABA Receptor",100,29290610,XCorr,3.4640052,1.0000000,,,,0.00047090000589378,
SPEVLPAFMSNLR,ph,S,418,true,"Tissue atlas Arabidopsis - ProteomicsDB",114,32188942,"MaxQuant score",134.9300000,1.0000000,,,,7.758100273314E-10,
QGLQSQLLSSPSNSHGGQGFLK,ph,S,440,true,"Tissue atlas Arabidopsis - ProteomicsDB",114,32188942,"MaxQuant score",271.4400000,0.9981730,,,,0,
QGLQSQLLSSPSNSHGGQGFLK,ph,S,442,true,"TOR Kinase and ABA Receptor",100,29290610,XCorr,4.1751895,0.9697000,,,,4.6339999244083E-5,
QGLQSQLLSSPSNSHGGQGFLK,ph,S,442,true,"Tissue atlas Arabidopsis - ProteomicsDB",114,32188942,"MaxQuant score",268.7600000,0.9591140,,,,0,
QLDALRSR,ph,S,459,true,"atm and atr DNA damage response",88,25561503,"MASCOT Score",28.0000000,1.0000000,,,,,-0.2400000
ASHKSPVTSPK,ph,S,480,true,"Tissue atlas Arabidopsis - ProteomicsDB",114,32188942,"MaxQuant score",58.6260000,0.9991430,,,,0.014470900408924,
NSQSLSSSPDRDFSHSLDVSPR,ph,S,494,true,"Tissue atlas Arabidopsis - ProteomicsDB",114,32188942,"MaxQuant score",122.4700000,0.9982430,,,,3.5853998248269E-21,
NSQSLSSSPDRDFSHSLDVSPR,ph,S,496,true,"Plasmamembrane phosphorylation",20,15308754,,,,,,,,
NSQSLSSSPDRDFSHSLDVSPR,ph,S,497,true,"Plasmamembrane phosphorylation",20,15308754,,,,,,,,
NSQSLSSSPDR,ph,S,498,true,"Tissue atlas Arabidopsis - ProteomicsDB",114,32188942,"MaxQuant score",122.4700000,0.9558550,,,,2.1810499008972E-21,
DFSHSLDVSPR,ph,S,506,true,"Tissue atlas Arabidopsis - ProteomicsDB",114,32188942,"MaxQuant score",183.0600000,0.9998880,,,,2.8810500941326E-14,
DFSHSLDVSPR,ph,S,510,true,"atm and atr DNA damage response",88,25561503,"MASCOT Score",22.0000000,1.0000000,,,,,0.1600000
DFSHSLDVSPR,ph,S,510,true,"Tissue atlas Arabidopsis - ProteomicsDB",114,32188942,"MaxQuant score",225.7900000,1.0000000,,,,0,
ISNISPQILQSR,ph,S,517,true,"TOR Kinase and ABA Receptor",100,29290610,XCorr,3.8887527,1.0000000,,,,0.00090899999486282,
ISNISPQILQSR,ph,S,517,true,"Tissue atlas Arabidopsis - ProteomicsDB",114,32188942,"MaxQuant score",192.5400000,1.0000000,,,,2.5550400081985E-24,
ASSDREMVWDHLR,ph,S,610,true,"Tissue atlas Arabidopsis - ProteomicsDB",114,32188942,"MaxQuant score",102.5800000,0.8547110,,,,5.106590106152E-5,
SLNNKPNQSQTTPR,ph,T,649,true,"atm and atr DNA damage response",88,25561503,"MASCOT Score",25.0000000,0.9280000,,,,,-1.5400000
SLNNKPNQSQTTPR,ph,T,650,true,"Tissue atlas Arabidopsis - ProteomicsDB",114,32188942,"MaxQuant score",127.9700000,0.9624040,,,,1.6827199942782E-5,
CVLPSPNQENR,ph,S,657,true,"Phosphorylation Early Elicitor Signaling",23,17317660,,,,,,,,
CVLPSPNQENR,ph,S,657,true,"Tissue atlas Arabidopsis - ProteomicsDB",114,32188942,"MaxQuant score",76.5220000,1.0000000,,,,0.0017479399684817,
AYNDDSPVKLGHAEK,ph,S,727,true,"Tissue atlas Arabidopsis - ProteomicsDB",114,32188942,"MaxQuant score",132.7900000,1.0000000,,,,4.4435799395615E-7,
AYNDDSPVK,ph,S,727,true,"atm and atr DNA damage response",88,25561503,"MASCOT Score",51.0000000,1.0000000,,,,,-0.7400000
VCKEVGMINERTMVSSAHK,ub,K,989,false,"Ubiquitylome analysis innate immunity",124,33793954,,,,,,,,
