Peptide,PTM,ModifiedAA,ModifiedPosition,PeptideUniqueToGene,ExperimentDesc,ExpID,PubmedID,ScoreType,IdentScore,LocProb,Log2FChange,PQ-val,QuantSig,PEP,MassErrorPPM
VFTPSEDEQVSAAEEALVTETVNEAPIEVQK,ph,T,202,true,"srk2dei ABA signaling phopshoproteomics",83,23572148,"MASCOT Score",24.0000000,,,,,,-0.0049000
VFTPSEDEQVSAAEEALVTETVNEAPIEVQK,ph,T,202,true,"Brassinosteroid-Regulated Phosphorylation Dynamics",94,26187819,"MaxQuant Score",85.0020000,0.9280000,,,,1.6369999400467E-7,2.3500000
VFTPSEDEQVSAAEEALVTETVNEAPIEVQK,ph,S,204,true,"SnRK2 protein kinase substrates",85,23776212,XCorr,6.1033325,0.9740000,,,,2.9881699464005E-14,
VFTPSEDEQVSAAEEALVTETVNEAPIEVQK,ph,S,204,true,"Brassinosteroid-Regulated Phosphorylation Dynamics",94,26187819,"MaxQuant Score",85.0020000,0.9350000,,,,1.6369999400467E-7,2.3500000
VFTPSEDEQVSAAEEALVTETVNEAPIEVQK,ph,S,204,true,"TOR Kinase and ABA Receptor",100,29290610,XCorr,5.1362476,0.8316000,,,,6.0559999838006E-5,
SINEPEKVFTPSEDEQVSAAEEALVTETVNEAPIEVQK,ph,S,210,true,"SnRK2 protein kinase substrates",85,23776212,XCorr,4.2413583,0.8900000,,,,7.0005999077694E-6,
VFTPSEDEQVSAAEEALVTETVNEAPIEVQK,ph,S,210,true,"Large-scale phosphorylation discovery",44,23111157,XCorr,4.7910000,,,,,,
VFTPSEDEQVSAAEEALVTETVNEAPIEVQK,ph,S,210,true,"SnRK2 protein kinase substrates",85,23776212,XCorr,3.7740047,0.9270000,,,,2.0636599629142E-7,
VFTPSEDEQVSAAEEALVTETVNEAPIEVQK,ph,S,210,true,"Brassinosteroid-Regulated Phosphorylation Dynamics",94,26187819,"MaxQuant Score",63.0850000,0.9440000,,,,0.0020000000949949,1.4440000
VFTPSEDEQVSAAEEALVTETVNEAPIEVQK,ph,S,210,true,"TOR Kinase and ABA Receptor",100,29290610,XCorr,5.1362476,0.9623000,,,,6.0559999838006E-5,
VGESDSRTGEIPK,ph,S,236,true,"atm and atr DNA damage response",88,25561503,"MASCOT Score",37.0000000,0.9390000,,,,,-0.2400000
RSYASIVK,ph,S,245,true,"atm and atr DNA damage response",88,25561503,"MASCOT Score",34.0000000,0.9990000,,,,,-2.9000000
SYASIVK,ph,S,248,true,"Tissue atlas Arabidopsis - ProteomicsDB",114,32188942,"MaxQuant score",97.5650000,0.9999990,,,,0.018455699086189,
ENAAPMSASRTPTKVEPK,ph,S,261,true,"Tissue atlas Arabidopsis - ProteomicsDB",114,32188942,"MaxQuant score",82.2670000,0.9265230,,,,4.9247300921706E-5,
ENAAPMSASRTPTK,ph,T,265,true,"TOR Kinase and ABA Receptor",100,29290610,XCorr,3.0053475,0.8960000,,,,0.0018269999418408,
KQEDQAIHIPLPTPLSEK,ph,T,285,true,"Tissue atlas Arabidopsis - ProteomicsDB",114,32188942,"MaxQuant score",153.5700000,1.0000000,,,,7.6868700082543E-19,
KQEDQAIHIPLPTPLSEK,ph,S,288,true,"Tissue atlas Arabidopsis - ProteomicsDB",114,32188942,"MaxQuant score",161.1300000,1.0000000,,,,0,
KQEDQAIHIPLPTPLSEKSDSGANVAVNENNQENER,ph,S,291,true,"TOR Kinase and ABA Receptor",100,29290610,XCorr,5.5570369,0.8997000,,,,0.0056940000504255,
KQEDQAIHIPLPTPLSEKSDSGANVAVNENNQENER,ph,S,291,true,"Tissue atlas Arabidopsis - ProteomicsDB",114,32188942,"MaxQuant score",161.1300000,0.9498190,,,,0,
SDSGANVAVNENNQENER,ph,S,291,true,"atm and atr DNA damage response",88,25561503,"MASCOT Score",55.0000000,0.9970000,,,,,0.4300000
GRSTFGVNTGYR,ph,S,397,true,"Tissue atlas Arabidopsis - ProteomicsDB",114,32188942,"MaxQuant score",84.0920000,0.9236230,,,,0.0012696400517598,
ATKPVDDAPR,ub,K,476,true,"Arabidopsis ubiquitination COFRADIC",40,26744219,"MaxQuant Score",82.4170000,1.0000000,,,,0.0040000001899898,-0.0560000
ATKPVDDAPRVSVAA,ph,S,485,true,"Tissue atlas Arabidopsis - ProteomicsDB",114,32188942,"MaxQuant score",197.1000000,1.0000000,,,,1.1213599890665E-33,
