Peptide,PTM,ModifiedAA,ModifiedPosition,PeptideUniqueToGene,ExperimentDesc,ExpID,PubmedID,ScoreType,IdentScore,LocProb,Log2FChange,PQ-val,QuantSig,PEP,MassErrorPPM
FGNWEAEENVPYTAYFDK,ph,T,21,true,"Large-scale phosphorylation discovery",44,23111157,XCorr,5.0780000,,,,,,
IMNPNDPEYNSDSQSQAPPHPPSSR,ph,S,47,true,"Plasmamembrane phosphorylation",20,15308754,,,,,,,,
IMNPNDPEYNSDSQSQAPPHPPSSR,ph,S,47,true,"Phytohormone-responsive phosphoproteins",34,20374526,"MASCOT Score",56.0000000,,,,,,2.3472500
IMNPNDPEYNSDSQSQAPPHPPSSR,ph,S,47,true,"SnRK2 protein kinase substrates",85,23776212,XCorr,2.9582319,0.8920000,,,,2.2034499124857E-5,
IMNPNDPEYNSDSQSQAPPHPPSSR,ph,S,47,true,"atm and atr DNA damage response",88,25561503,"MASCOT Score",55.0000000,0.9920000,,,,,-1.0700000
IMNPNDPEYNSDSQSQAPPHPPSSR,ph,S,47,true,"TOR Kinase and ABA Receptor",100,29290610,XCorr,4.9921746,0.8867000,,,,2.8599998813661E-7,
IMNPNDPEYNSDSQSQAPPHPPSSR,ph,S,47,true,"Tissue atlas Arabidopsis - ProteomicsDB",114,32188942,"MaxQuant score",238.8600000,0.9939110,,,,0,
SQAPPHPPSSR,nt,S,51,true,"N-terminal ChaFRADIC",92,26010716,"MASCOT Score",21.8800000,,,,,0.00012510000669863,
TKPEQVDTVR,ub,K,63,true,"Arabidopsis ubiquitination COFRADIC",40,26744219,"MaxQuant Score",46.8440000,1.0000000,,,,0.0049999998882413,0.2880000
TKPEQVDTVRR,ph,T,69,true,"atm and atr DNA damage response",88,25561503,"MASCOT Score",29.0000000,1.0000000,,,,,-2.2700000
SREESELK,ph,S,79,true,"Sucrose-induced phosphorylation",24,17586839,,,,,,,,
SREESELK,ph,S,79,true,"atm and atr DNA damage response",88,25561503,"MASCOT Score",20.0000000,1.0000000,,,,,-0.9900000
SREESELK,ph,S,79,true,"Protein sumoylation and phosphorylation cross-talk",97,28419593,,,,,,,,
SREESELK,ph,S,79,true,"Phospho cell culture sucrose/TOR",109,30833711,,,0.9907320,,,,,
SREESELK,ph,S,79,true,"Tissue atlas Arabidopsis - ProteomicsDB",114,32188942,"MaxQuant score",156.8400000,0.9998690,,,,7.5415094766018E-39,
QFGDAGGSSNEAANKR,ph,S,94,true,"atm and atr DNA damage response",88,25561503,"MASCOT Score",63.0000000,0.9180000,,,,,-0.3500000
QFGDAGGSSNEAANKR,ph,S,94,true,"Tissue atlas Arabidopsis - ProteomicsDB",114,32188942,"MaxQuant score",148.1800000,1.0000000,,,,5.8205901209973E-10,
QFGDAGGSSNEAANK,ph,S,94,true,"atm and atr DNA damage response",88,25561503,"MASCOT Score",67.0000000,1.0000000,,,,,-0.0900000
QFGDAGGSSNEAANK,ph,S,94,true,"TOR Kinase and ABA Receptor",100,29290610,XCorr,4.4997258,0.9132000,,,,1.5940000253067E-7,
QFGDAGGSSNEAANKR,ph,S,95,true,"atm and atr DNA damage response",88,25561503,"MASCOT Score",39.0000000,1.0000000,,,,,-1.6000000
QFGDAGGSSNEAANKR,ph,S,95,true,"Tissue atlas Arabidopsis - ProteomicsDB",114,32188942,"MaxQuant score",81.7230000,1.0000000,,,,5.7865301641868E-5,
ASQNNSYDNKSPLHK,ph,S,107,true,"Chloroplast kinase substrates",60,19376835,"MASCOT Score",38.7300000,,,,,,-0.7699250
ASQNNSYDNKSPLHK,ph,S,107,true,"Tissue atlas Arabidopsis - ProteomicsDB",114,32188942,"MaxQuant score",55.2080000,0.9966350,,,,0.0060851499438286,
ASQNNSYDNKSPLHK,ph,S,111,true,"Tissue atlas Arabidopsis - ProteomicsDB",114,32188942,"MaxQuant score",87.7670000,0.9979060,,,,1.1306899978081E-5,
ASQNNSYDNKSPLHKNSYDGTGK,ph,S,116,true,"Phosphoproteome ethylene-regulated time response",46,24043427,"MASCOT Score",101.1700000,,,,,,-14.8333000
ASQNNSYDNKSPLHK,ph,S,116,true,"Ethylene-regulated phosphorylation ein2 mutant",30,19253305,"MASCOT Score",63.2184000,,,,,,-13.8391350
ASQNNSYDNKSPLHK,ph,S,116,true,"STN8 phosphoproteome",38,21768351,"MASCOT Score",48.3400000,,,,,,-0.5529560
ASQNNSYDNKSPLHK,ph,S,116,true,"Phosphoproteome ethylene-regulated time response",46,24043427,"MASCOT Score",44.0300000,,,,,,0.1869700
ASQNNSYDNKSPLHK,ph,S,116,true,"Chloroplast kinase substrates",60,19376835,"MASCOT Score",47.0100000,,,,,,-0.0991226
ASQNNSYDNKSPLHK,ph,S,116,true,"atm and atr DNA damage response",88,25561503,"MASCOT Score",43.0000000,1.0000000,,,,,-0.5200000
ASQNNSYDNKSPLHK,ph,S,116,true,"Protein sumoylation and phosphorylation cross-talk",97,28419593,,,,,,,,
ASQNNSYDNKSPLHK,ph,S,116,true,"TOR Kinase and ABA Receptor",100,29290610,XCorr,2.6924553,0.9957000,,,,0.023150000721216,
ASQNNSYDNKSPLHK,ph,S,116,true,"Phospho cell culture sucrose/TOR",109,30833711,,,0.9999970,,,,,
ASQNNSYDNKSPLHK,ph,S,116,true,"Col-0 callus - FC Col-0 vs. Col-0 Xray",111a,31410901,,45.4700000,,-3.7689615,0.0000000,NO,,0.2703837
ASQNNSYDNKSPLHK,ph,S,116,true,"Col-0 X-ray callus - FC Col-0 vs. Col-0 Xray",111b,31410901,,45.4700000,,-3.7689615,0.0000000,NO,,0.2703837
ASQNNSYDNKSPLHK,ph,S,116,true,"atm callus - FC atm vs. atm Xray",111c,31410901,,45.4700000,,2.3353186,0.0000000,NO,,0.2703837
ASQNNSYDNKSPLHK,ph,S,116,true,"atm-3 X-ray callus - FC atm vs. atm Xray",111d,31410901,,45.4700000,,2.3353186,0.0000000,NO,,0.2703837
ASQNNSYDNKSPLHK,ph,S,116,true,"Tissue atlas Arabidopsis - ProteomicsDB",114,32188942,"MaxQuant score",400.9000000,1.0000000,,,,0,
SPLHKNSYDGTGK,ph,S,122,true,"atm and atr DNA damage response",88,25561503,"MASCOT Score",30.0000000,1.0000000,,,,,-2.3800000
SPLHKNSYDGTGK,ph,S,122,true,"Tissue atlas Arabidopsis - ProteomicsDB",114,32188942,"MaxQuant score",233.5700000,1.0000000,,,,0,
NSYDGTGK,ph,S,122,true,"atm and atr DNA damage response",88,25561503,"MASCOT Score",30.0000000,1.0000000,,,,,-1.9200000
SRPKPTNLRADESPEKVTVVPK,ph,S,141,true,"Phosphoproteome ethylene-regulated time response",46,24043427,"MASCOT Score",47.2100000,,,,,,-0.1783800
ADESPEKVTVVPK,ph,S,141,true,"Plasmamembrane phosphorylation",20,15308754,,,,,,,,
ADESPEKVTVVPK,ph,S,141,true,"Sucrose-induced phosphorylation",24,17586839,,,,,,,,
ADESPEKVTVVPK,ph,S,141,true,"Plasmembrane Ph Immune Responses",25,17651370,,,,,,,,
ADESPEKVTVVPK,ph,S,141,true,"Phosphorylation nuclei-enriched fractions",28,19245862,,,,,,,,
ADESPEKVTVVPK,ph,S,141,true,"STN8 phosphoproteome",38,21768351,"MASCOT Score",57.9300000,,,,,,0.1493090
ADESPEKVTVVPK,ph,S,141,true,"Phosphoproteome ethylene-regulated time response",46,24043427,"MASCOT Score",74.9000000,,,,,,4.3394000
ADESPEKVTVVPK,ph,S,141,true,"Chloroplast kinase substrates",60,19376835,"MASCOT Score",56.4600000,,,,,,-0.3685710
ADESPEKVTVVPK,ph,S,141,true,"BSK8 and BSL2 regulating sucrose-ph synthase",66,24924143,"MaxQuant Score",145.8600000,,,,,,-0.6808700
ADESPEKVTVVPK,ph,S,141,true,"LAXIC - ABA stress",84a,23660473,XCorr,3.3700000,1.0000000,,,,0.068928398191929,
ADESPEKVTVVPK,ph,S,141,true,"LAXIC - mannitol vs control",84b,23660473,XCorr,3.3800000,1.0000000,-1.3504301,,NO,1.0799999472511E-6,
ADESPEKVTVVPK,ph,S,141,true,"SnRK2 protein kinase substrates",85,23776212,XCorr,4.1254411,1.0000000,,,,7.4470399624715E-8,
ADESPEKVTVVPK,ph,S,141,true,"SIRK1 phosphorylation",86a,23820729,"MaxQuant Score",98.9600000,0.9990000,,,,0.18899999558926,8.3730000
ADESPEKVTVVPK,ph,S,141,true,"SIRK1 exp - sirk1 mutant vs WT",86b,23820729,,,,-0.1365989,,NO,,
ADESPEKVTVVPK,ph,S,141,true,"SIRK1 exp - 35S:SIRK1 vs WT",86c,23820729,,,,0.2205898,,NO,,
ADESPEKVTVVPK,ph,S,141,true,"atm and atr DNA damage response",88,25561503,"MASCOT Score",43.0000000,1.0000000,,,,,-1.6000000
ADESPEKVTVVPK,ph,S,141,true,"Protein sumoylation and phosphorylation cross-talk",97,28419593,,,,,,,,
ADESPEKVTVVPK,ph,S,141,true,"Phosphorylation tonoplast membrane fraction",107,18686298,"MASCOT Score",40.0000000,,,,,,
ADESPEKVTVVPK,ph,S,141,true,"Col-0 callus - FC Col-0 vs. Col-0 Xray",111a,31410901,,37.1300000,,-0.4981842,0.0000000,NO,,0.7243293
ADESPEKVTVVPK,ph,S,141,true,"Col-0 X-ray callus - FC Col-0 vs. Col-0 Xray",111b,31410901,,37.1300000,,-0.4981842,0.0000000,NO,,0.7243293
ADESPEKVTVVPK,ph,S,141,true,"atm callus - FC atm vs. atm Xray",111c,31410901,,37.1300000,,-1.2550009,0.0000000,NO,,0.7243293
ADESPEKVTVVPK,ph,S,141,true,"atm-3 X-ray callus - FC atm vs. atm Xray",111d,31410901,,37.1300000,,-1.2550009,0.0000000,NO,,0.7243293
ADESPEKVTVVPK,ph,S,141,true,"Tissue atlas Arabidopsis - ProteomicsDB",114,32188942,"MaxQuant score",279.7100000,1.0000000,,,,0,
ADESPEKVTVVPK,ph,S,141,true,"Touch-induced phosphorylation: 40s touch vs untouc",136,30291188,"MASCOT score",60.0700000,,-0.0762852,0.5692804,NO,,3.6945909
ADESPEKVTVVPK,ph,T,146,true,"SIRK1 phosphorylation",86a,23820729,"MaxQuant Score",105.4300000,0.9690000,,,,0.10999999940395,-1.7720000
FGDWDENNPSSADGYTHIFNK,ph,T,166,true,"TOR Kinase and ABA Receptor",100,29290610,XCorr,3.8185418,0.8763000,,,,7.9880001067067E-6,
FGDWDENNPSSADGYTHIFNK,ph,T,166,true,"Tissue atlas Arabidopsis - ProteomicsDB",114,32188942,"MaxQuant score",115.1200000,0.9991340,,,,3.4364199853754E-13,
SSGANVSGSSRTPTHQSSR,ph,S,183,true,"atm and atr DNA damage response",88,25561503,"MASCOT Score",42.0000000,0.9910000,,,,,0.9500000
SSGANVSGSSRTPTHQSSR,ph,S,183,true,"Tissue atlas Arabidopsis - ProteomicsDB",114,32188942,"MaxQuant score",167.3400000,0.9990770,,,,1.5523999692298E-34,
SSGANVSGSSRTPTHQSSR,ph,S,185,true,"Tissue atlas Arabidopsis - ProteomicsDB",114,32188942,"MaxQuant score",161.4800000,0.9352160,,,,1.5523999692298E-34,
SSGANVSGSSR,ph,S,185,true,"Protein sumoylation and phosphorylation cross-talk",97,28419593,,,,,,,,
SSGANVSGSSRTPTHQSSR,ph,S,186,true,"Tissue atlas Arabidopsis - ProteomicsDB",114,32188942,"MaxQuant score",190.6300000,0.7839870,,,,0,
SSGANVSGSSRTPTHQSSR,ph,T,188,true,"atm and atr DNA damage response",88,25561503,"MASCOT Score",27.0000000,0.9920000,,,,,0.9900000
SSGANVSGSSRTPTHQSSR,ph,T,188,true,"Tissue atlas Arabidopsis - ProteomicsDB",114,32188942,"MaxQuant score",192.2700000,0.8855750,,,,0,
SSGANVSGSSRTPTHQSSR,ph,S,193,true,"atm and atr DNA damage response",88,25561503,"MASCOT Score",23.0000000,0.9750000,,,,,-0.3800000
TPTHQSSRNPNNTSSCCCFGFGGK,ph,S,194,true,"Tissue atlas Arabidopsis - ProteomicsDB",114,32188942,"MaxQuant score",111.9800000,0.7787600,,,,2.1452200152869E-21,
SSGANVSGSSRTPTHQSSR,ph,S,194,true,"atm and atr DNA damage response",88,25561503,"MASCOT Score",22.0000000,0.9880000,,,,,-0.1300000
NPNNTSSCCCFGFGGK,acy,C,203,true,"Arabidopsis S-acylation atlas - Hypocotyl",163b,35681017,,,,,,,,
NPNNTSSCCCFGFGGK,acy,C,203,true,"Arabidopsis S-acylation atlas - Leaf",163c,35681017,,,,,,,,
NPNNTSSCCCFGFGGK,acy,C,203,true,"Arabidopsis S-acylation atlas - Seedling",163d,35681017,,,,,,,,
NPNNTSSCCCFGFGGK,acy,C,203,true,"Arabidopsis S-acylation atlas - Stem",163f,35681017,,,,,,,,
NPNNTSSCCCFGFGGK,acy,C,204,true,"Arabidopsis S-acylation atlas - Hypocotyl",163b,35681017,,,,,,,,
NPNNTSSCCCFGFGGK,acy,C,204,true,"Arabidopsis S-acylation atlas - Leaf",163c,35681017,,,,,,,,
NPNNTSSCCCFGFGGK,acy,C,204,true,"Arabidopsis S-acylation atlas - Seedling",163d,35681017,,,,,,,,
NPNNTSSCCCFGFGGK,acy,C,204,true,"Arabidopsis S-acylation atlas - Stem",163f,35681017,,,,,,,,
NPNNTSSCCCFGFGGK,acy,C,205,true,"Arabidopsis S-acylation atlas - Hypocotyl",163b,35681017,,,,,,,,
NPNNTSSCCCFGFGGK,acy,C,205,true,"Arabidopsis S-acylation atlas - Leaf",163c,35681017,,,,,,,,
NPNNTSSCCCFGFGGK,acy,C,205,true,"Arabidopsis S-acylation atlas - Seedling",163d,35681017,,,,,,,,
NPNNTSSCCCFGFGGK,acy,C,205,true,"Arabidopsis S-acylation atlas - Stem",163f,35681017,,,,,,,,
