Peptide,PTM,ModifiedAA,ModifiedPosition,PeptideUniqueToGene,ExperimentDesc,ExpID,PubmedID,ScoreType,IdentScore,LocProb,Log2FChange,PQ-val,QuantSig,PEP,MassErrorPPM
KAASAQASSSVGE,nt,K,61,true,"Arg/N-end rule seed, prt6 vs. Wt",99,29168982,"MASCOT Score",57.4100000,,,,,2.0449999283301E-5,0.7338534
KAASAQASSSVGE,nta,K,61,true,"Arg/N-end rule seed, prt6 vs. Wt",99,29168982,"MASCOT Score",57.4100000,,0.1297427,0.7675529,NO,2.0449999283301E-5,0.7338534
AASAQASSSVGE,nt,A,62,true,"N-terminal ChaFRADIC",92,26010716,"MASCOT Score",42.7100000,,,,,6.9549998443108E-5,
AASAQASSSVGE,nt,A,62,true,"Arg/N-end rule seed, prt6 vs. Wt",99,29168982,"MASCOT Score",32.9900000,,0.0956241,0.5618179,NO,0.0018810000037774,-6.9504717
AASAQASSSVGESVAQTSEK,nta,A,62,true,"Characterization plant N-terminal acetylation",6,22223895,"MASCOT Score",61.2300000,,,,,,
AASAQASSSVGE,nta,A,62,true,"N-terminal ChaFRADIC",92,26010716,"MASCOT Score",20.1700000,,,,,0.016569999977946,
ASAQASSSVGE,nt,A,63,true,"N-terminal ChaFRADIC",92,26010716,"MASCOT Score",47.5000000,,,,,7.8110002505127E-5,
SAQASSSVGE,nt,S,64,true,"N-terminal ChaFRADIC",92,26010716,"MASCOT Score",57.8200000,,,,,2.4670000129845E-5,
SAQASSSVGE,nt,S,64,true,"Arg/N-end rule seed, prt6 vs. Wt",99,29168982,"MASCOT Score",54.3200000,,0.4218660,0.0530077,NO,0.00017719999596011,-4.1853872
LELTTPACPVK,sno,C,128,true,"hot5-4 / wildtype, FAT-switch S-nitrosoproteome",169,37277371,,,,-0.0985195,0.6255315,NO,,
VPCVAVVENMCHFDADGK,so,C,339,true,"Arabidopsis S-sulfenylation chemoproteomics",108,31578252,"pFind PSM Score",0.0030166,,1.5873000,,,,-1.2992890
