Peptide,PTM,ModifiedAA,ModifiedPosition,PeptideUniqueToGene,ExperimentDesc,ExpID,PubmedID,ScoreType,IdentScore,LocProb,Log2FChange,PQ-val,QuantSig,PEP,MassErrorPPM
YAAKEIKFGVEAR,nt,Y,31,true,"Mitochondrial intermediate peptidases - icp55 / WT",131a,25732537,,74.0800000,,4.0769627,,,,
YAAKEIKFGVEAR,nt,Y,31,true,"Mitochondrial intermediate peptidases - oct1-1 / WT",131b,25732537,,77.6700000,,-0.1806995,,,,
YAAKEIKFGVEAR,nt,Y,31,true,"Mitochondrial intermediate peptidases - oct1-2 / WT",131c,25732537,,83.9600000,,-0.0398557,,,,
YAAKEIKFGVEAR,nt,Y,31,true,"Arabidopsis translation initiation landscape - NT",167b,35069635,,,,,,,,
AAKEIKFGVEARAL,nt,A,32,true,"Arabidopsis translation initiation landscape - NT",167b,35069635,,,,,,,,
AAKEIKFGVEAR,nt,A,32,true,"Arg/N-end rule pathway Roots",80,25728785,"MASCOT Score",66.1600000,,,,,0.00010170000314247,
AAKEIKFGVEAR,nt,A,32,true,"Mitochondrial intermediate peptidases - icp55 / WT",131a,25732537,,85.2700000,,-6.6438562,,,,
AAKEIKFGVEAR,nt,A,32,true,"Mitochondrial intermediate peptidases - oct1-1 / WT",131b,25732537,,78.3600000,,0.1664232,,,,
AAKEIKFGVEAR,nt,A,32,true,"Mitochondrial intermediate peptidases - oct1-2 / WT",131c,25732537,,85.2700000,,0.1930738,,,,
AAKEIKFGVEAR,nta,A,32,true,"FtsH12 N-terminome: WT / FtsH12 knockdown miRNA",118,33216923,"MaxQuant score",64.4390000,,0.0870426,0.6770887,NO,1.9500000572603E-12,
AAKEIKFGVEAR,nta,A,32,true,"Mitochondrial intermediate peptidases - oct1-1 / WT",131b,25732537,,60.6700000,,,,,,
AAKEIKFGVEAR,nta,A,32,true,"Mitochondrial intermediate peptidases - oct1-2 / WT",131c,25732537,,64.0600000,,,,,,
EIKFGVEAR,nt,E,35,true,"Metacaspase9 substrates - 35S:MC9 / mc9",51b,23964026,"MASCOT Score",59.0000000,,,,,,-1.1708786
GVEDLADAVKVTMGPKGR,nt,G,49,false,"Metacaspase9 substrates - Col-0 / mc9",51a,23964026,"MASCOT Score",64.0000000,,,,,,-1.3941432
GVEDLADAVKVTMGPKGR,nt,G,49,false,"Arabidopsis translation initiation landscape - NT",167b,35069635,,,,,,,,
VTMGPK,mox,M,61,false,"cat2 Methionine oxidation - 3h stress",62b,25693801,"MASCOT Score",35.0000000,,-0.1990535,,NO,,
IKNVGASLVK,ac,K,97,false,"Quantitative Acetylproteomics",101,29440448,,,,,,,,
QVANATNDVAGDGTTCATVLTR,ox,C,121,false,"Redox kickstart of mitochondria",112,31871212,,,,-1.9255283,0.0016020,YES,,
QVANATNDVAGDGTTCATVLTR,sno,C,121,false,"hot5-4 / wildtype, FAT-switch S-nitrosoproteome",169,37277371,,,,,,,,
QVANATNDVAGDGTTCATVLTR,so,C,121,false,"S-sulfenylation site detection using YAP1C",110,32714340,,,,,,,,
AIFAEGCK,ox,C,134,true,"OxiTRAQ Arabidopsis - 5 mM H2O2 versus control",47,24376095,,,,0.1934765,0.1175057,NO,,
AIFAEGCK,ox,C,134,true,"Redox kickstart of mitochondria",112,31871212,,,,-1.3236099,0.0025599,YES,,
AIFAEGCK,sno,C,134,true,"hot5-4 / wildtype, FAT-switch S-nitrosoproteome",169,37277371,,,,-0.0959554,0.5750318,NO,,
AIFAEGCK,so,C,134,true,"Arabidopsis S-sulfenylation chemoproteomics",108,31578252,"pFind PSM Score",0.0823619,,0.7462700,,,,-1.0153952
AIFAEGCK,so,C,134,true,"S-sulfenylation site detection using YAP1C",110,32714340,,,,,,,,
SVAAGMNAMDLR,nt,S,136,false,"Arabidopsis translation initiation landscape - NT",167b,35069635,,,,,,,,
CELDDPLILIHEK,sno,C,243,true,"hot5-4 / wildtype, FAT-switch S-nitrosoproteome",169,37277371,,,,,,,,
CELDDPLILIHEK,so,C,243,true,"S-sulfenylation site detection using YAP1C",110,32714340,,,,,,,,
VLELALKR,ac,K,272,true,"Quantitative Acetylproteomics",101,29440448,,,,,,,,
VDLSMLGTCK,ox,C,350,true,"Redox kickstart of mitochondria",112,31871212,,,,-1.7189280,0.0037270,YES,,
VDLSMLGTCK,ox,C,350,true,"Bicarbonate Induced Redox Changes - 30 min",117b,28184230,,,,0.4854268,,YES,,
VDLSMLGTCK,sno,C,350,true,"hot5-4 / wildtype, FAT-switch S-nitrosoproteome",169,37277371,,,,,,,,
VDLSMLGTCKK,so,C,350,true,"S-sulfenylation site detection using YAP1C",110,32714340,,,,,,,,
SAIELSTSDYDKEKLQER,ub,K,392,true,"Arabidopsis ubiquitination COFRADIC",40,26744219,"MaxQuant Score",62.2030000,0.9410000,,,,5.9320000300733E-11,-0.0440000
SAIELSTSDYDKEKLQER,ub,K,394,true,"Arabidopsis ubiquitination COFRADIC",40,26744219,"MaxQuant Score",71.5920000,0.9060000,,,,3.7399999763821E-11,-0.4960000
IASNAGVE,nt,I,484,false,"Arg/N-end rule seed, prt6 vs. Wt",99,29168982,"MASCOT Score",47.6100000,,-0.3157407,0.0910966,NO,0.020740000531077,0.2083714
QDNPDLGYDAAKGE,nt,Q,502,false,"HUNTER N-terminome: legumain, GluC and trypsin",119,31951383,"MaxQuant score",59.5700000,,,,,,
QDNPDLGYD,nt,Q,502,false,"Arg/N-end rule seed, prt6 vs. Wt",99,29168982,"MASCOT Score",56.6200000,,0.5626281,0.3939763,NO,0.0062870001420379,-1.5423956
SVSSLLTTTE,nt,S,540,false,"Arg/N-end rule seed, prt6 vs. Wt",99,29168982,"MASCOT Score",34.4100000,,-1.0856290,0.0342000,YES,0.045269999653101,-3.8872086
