Peptide,PTM,ModifiedAA,ModifiedPosition,PeptideUniqueToGene,ExperimentDesc,ExpID,PubmedID,ScoreType,IdentScore,LocProb,Log2FChange,PQ-val,QuantSig,PEP,MassErrorPPM
KASQNTQPVDNSQQSVIDSDGAGASISNGPLK,ph,S,52,true,"Tissue atlas Arabidopsis - ProteomicsDB",114,32188942,"MaxQuant score",99.7090000,0.9924950,,,,2.1239899914182E-25,
VDFSNSLELIGSSK,ph,S,121,true,"Large-scale phosphorylation discovery",44,23111157,XCorr,3.5160000,,,,,,
VDFSNSLELIGSSK,ph,S,121,true,"atm and atr DNA damage response",88,25561503,"MASCOT Score",29.0000000,0.9940000,,,,,0.0800000
VDFSNSLELIGSSK,ph,S,121,true,"TOR Kinase and ABA Receptor",100,29290610,XCorr,3.1546910,0.8905000,,,,0.0018540000310168,
VDFSNSLELIGSSK,ph,S,121,true,"Tissue atlas Arabidopsis - ProteomicsDB",114,32188942,"MaxQuant score",323.0200000,0.9708760,,,,0,
QSSESFDR,ph,S,144,true,"atm and atr DNA damage response",88,25561503,"MASCOT Score",23.0000000,0.9950000,,,,,-0.0800000
QSSESFDR,ph,S,144,true,"Tissue atlas Arabidopsis - ProteomicsDB",114,32188942,"MaxQuant score",113.3900000,0.9272330,,,,7.4060499712744E-28,
ETASLFSGTSMQMDGFIHGSGLTSSRK,fuc,S,158,true,"SPINDLY O-fucosylation",162,36739885,,,,,,,-0.37999999523163,
ASTLRETASLFSGTSMQMDGFIHGSGLTSSR,fuc,T,163,true,"SPINDLY O-fucosylation",162,36739885,,,,,,,-0.5799999833107,
ETASLFSGTSMQMDGFIHGSGLTSSRK,fuc,T,163,true,"SPINDLY O-fucosylation",162,36739885,,,,,,,-0.6700000166893,
ETASLFSGTSMQMDGFIHGSGLTSSR,fuc,S,164,true,"SPINDLY O-fucosylation",162,36739885,,,,,,,1.2999999523163,
KDSLQPTTR,ub,K,181,true,"Arabidopsis ubiquitination COFRADIC",40,26744219,"MaxQuant Score",66.0560000,1.0000000,,,,0.012000000104308,1.4140000
KDSLQPTTR,ph,S,183,true,"atm and atr DNA damage response",88,25561503,"MASCOT Score",27.0000000,1.0000000,,,,,-1.7600000
KDSLQPTTR,ph,S,183,true,"Tissue atlas Arabidopsis - ProteomicsDB",114,32188942,"MaxQuant score",113.4200000,1.0000000,,,,0.00033598201116547,
MAGSFDEVAK,ph,S,193,true,"Tissue atlas Arabidopsis - ProteomicsDB",114,32188942,"MaxQuant score",122.1800000,1.0000000,,,,0.00012415199307725,
SRPSFLDSLNISR,ph,S,263,true,"Tissue atlas Arabidopsis - ProteomicsDB",114,32188942,"MaxQuant score",124.2900000,0.9930970,,,,1.70558996615E-5,
SRPSFLDSLNISR,ph,S,267,true,"Tissue atlas Arabidopsis - ProteomicsDB",114,32188942,"MaxQuant score",92.4390000,0.9999870,,,,8.8605498604011E-5,
RDSNGPSSLTSGASDYPNPFEK,ph,S,312,true,"Tissue atlas Arabidopsis - ProteomicsDB",114,32188942,"MaxQuant score",289.6000000,0.9999740,,,,0,
MAIDNVSPEKQQPDTHVVQER,ph,S,665,true,"Tissue atlas Arabidopsis - ProteomicsDB",114,32188942,"MaxQuant score",244.3000000,1.0000000,,,,0,
MAIDNVSPEK,ph,S,665,true,"Tyrosine phosphorylation in Arabidopsis",59,18463617,"MASCOT Score",55.0000000,,,,,,-0.2537000
MAIDNVSPEK,ph,S,665,true,"TOR Kinase and ABA Receptor",100,29290610,XCorr,3.4141741,1.0000000,,,,0.00012450000212993,
MAIDNVSPEK,ph,S,665,true,"Phospho cell culture sucrose/TOR",109,30833711,,,1.0000000,,,,,
TPIADEGDEVVER,ph,T,680,true,"Tissue atlas Arabidopsis - ProteomicsDB",114,32188942,"MaxQuant score",88.7800000,1.0000000,,,,0.0002779669885058,
