Peptide,PTM,ModifiedAA,ModifiedPosition,PeptideUniqueToGene,ExperimentDesc,ExpID,PubmedID,ScoreType,IdentScore,LocProb,Log2FChange,PQ-val,QuantSig,PEP,MassErrorPPM
SAQSVTADPSPPITDTNKLNKYSSR,nt,S,35,true,"Arg/N-end rule pathway Roots",80,25728785,"MASCOT Score",44.4000000,,,,,1.8029999409919E-5,
SAQSVTADPSPPITDTNKLNKYSSR,nt,S,35,true,"Stromal N-terminome",96,26371235,"MASCOT Score",52.6900000,,,,,,
SAQSVTADPSPPITDTNKLNKYSSR,nt,S,35,true,"HUNTER N-terminome: legumain, GluC and trypsin",119,31951383,"MaxQuant score",215.9100000,,,,,,
SAQSVTADPSPPITDTNKLNKYSSR,nt,S,35,true,"Arabidopsis translation initiation landscape - NT",167b,35069635,,,,,,,,
SAQSVTADPSPPITDTN,nt,S,35,true,"HUNTER N-terminome: legumain, GluC and trypsin",119,31951383,"MaxQuant score",235.1100000,,,,,,
SAQSVTADPSPPITD,nt,S,35,true,"HUNTER N-terminome: legumain, GluC and trypsin",119,31951383,"MaxQuant score",201.0000000,,,,,,
SAQSVTADPSPPITDTNKLNKYSSR,nta,S,35,true,"Stromal N-terminome",96,26371235,"MASCOT Score",44.8100000,,,,,,
SAQSVTADPSPPITDTNKLNKYSSR,nta,S,35,true,"FtsH12 N-terminome: WT / FtsH12 knockdown miRNA",118,33216923,"MaxQuant score",73.9270000,,,,,0.0063184997998178,
SAQSVTADPSPPITDTNK,nta,S,35,true,"Characterization plant N-terminal acetylation",6,22223895,"MASCOT Score",52.3300000,,,,,,
SAQSVTADPSPPITDTN,nta,S,35,true,"HUNTER N-terminome: legumain, GluC and trypsin",119,31951383,"MaxQuant score",153.3900000,,,,,,
SAQSVTADPSPPITD,nta,S,35,true,"HUNTER N-terminome: legumain, GluC and trypsin",119,31951383,"MaxQuant score",103.8800000,,,,,,
AQSVTADPSPPITDTNKLNKYSSR,nt,A,36,true,"Stromal N-terminome",96,26371235,"MASCOT Score",31.9800000,,,,,,
AQSVTADPSPPITDTNKLNKYSSR,nt,A,36,true,"HUNTER N-terminome: legumain, GluC and trypsin",119,31951383,"MaxQuant score",52.3590000,,,,,,
AQSVTADPSPPITDTNKLNKYSSR,nt,A,36,true,"Arabidopsis translation initiation landscape - NT",167b,35069635,,,,,,,,
AQSVTADPSPPITD,nt,A,36,true,"HUNTER N-terminome: legumain, GluC and trypsin",119,31951383,"MaxQuant score",79.8200000,,,,,,
SIPAEDPLKL,nt,S,270,true,"N-terminal ChaFRADIC",92,26010716,"MASCOT Score",21.6400000,,,,,0.0014900000533089,
DIITPKSLR,ac,K,306,true,"Quantitative Acetylproteomics",101,29440448,,,,,,,,
YVMEDIHK,mox,M,365,true,"cat2 Methionine oxidation - 1h stress",62a,25693801,"MASCOT Score",32.0000000,,-0.6041608,,NO,,
YVMEDIHK,mox,M,365,true,"cat2 Methionine oxidation - 3h stress",62b,25693801,"MASCOT Score",38.0000000,,0.1625523,,NO,,
MTVTGQTLAQNLE,nt,M,392,true,"Arg/N-end rule seed, prt6 vs. Wt",99,29168982,"MASCOT Score",70.3700000,,-1.4427250,0.0005020,YES,1.7379999917466E-5,-2.1929686
ECALLTDGR,ox,C,514,true,"OxiTRAQ Arabidopsis - 5 mM H2O2 versus control",47,24376095,,,,-0.1903890,0.3206575,NO,,
ECALLTDGR,sno,C,514,true,"hot5-4 / wildtype, FAT-switch S-nitrosoproteome",169,37277371,,,,0.2229962,0.3974088,NO,,
FSGGSHGFVVGHICPEAQEGGPIGLIK,so,C,535,true,"S-sulfenylation site detection using YAP1C",110,32714340,,,,,,,,
NVQSASDGCVTDE,ox,C,604,true,"OxiTRAQ Arabidopsis - 5 mM H2O2 versus control",47,24376095,,,,-0.1576624,0.3994626,NO,,
