Peptide,PTM,ModifiedAA,ModifiedPosition,PeptideUniqueToGene,ExperimentDesc,ExpID,PubmedID,ScoreType,IdentScore,LocProb,Log2FChange,PQ-val,QuantSig,PEP,MassErrorPPM
GSAASGGKPIWMK,ph,S,10,true,"Tissue atlas Arabidopsis - ProteomicsDB",114,32188942,"MaxQuant score",114.6400000,0.9999840,,,,0.00017941299302038,
GVDQTTHLIEPVAPVPESAPESDSDSDDDDDDESDYLSR,ph,S,66,true,"SnRK2 protein kinase substrates",85,23776212,XCorr,4.6655979,0.8630000,,,,0.0031100700143725,
GVDQTTHLIEPVAPVPESAPESDSDSDDDDDDESDYLSR,ph,S,70,true,"SnRK2 protein kinase substrates",85,23776212,XCorr,4.0986023,0.8530000,,,,3.4391600820527E-6,
GSLGSPEKGENGDLKK,ph,S,337,true,"SnRK2 protein kinase substrates",85,23776212,XCorr,2.0480270,0.9570000,,,,0.010096900165081,
GSLGSPEKGENGDLK,ph,S,337,true,"Large-scale phosphorylation discovery",44,23111157,XCorr,3.0090000,,,,,,
GSLGSPEKGENGDLK,ph,S,337,true,"Tissue atlas Arabidopsis - ProteomicsDB",114,32188942,"MaxQuant score",69.7290000,0.7955140,,,,0.0010745000327006,
GSLGSPEKGENGDLKK,ph,S,340,true,"STN8 phosphoproteome",38,21768351,"MASCOT Score",47.8100000,,,,,,0.8152190
GSLGSPEKGENGDLKK,ph,S,340,true,"Phosphoproteome ethylene-regulated time response",46,24043427,"MASCOT Score",47.0300000,,,,,,-18.4469000
GSLGSPEKGENGDLKK,ph,S,340,true,"Tyrosine phosphorylation in Arabidopsis",59,18463617,"MASCOT Score",29.0000000,,,,,,-1.0030766
GSLGSPEKGENGDLKK,ph,S,340,true,"Chloroplast kinase substrates",60,19376835,"MASCOT Score",35.5700000,,,,,,-1.2168100
GSLGSPEKGENGDLKK,ph,S,340,true,"Phospho cell culture sucrose/TOR",109,30833711,,,1.0000000,,,,,
GSLGSPEKGENGDLKK,ph,S,340,true,"Tissue atlas Arabidopsis - ProteomicsDB",114,32188942,"MaxQuant score",221.7900000,1.0000000,,,,0,
GSLGSPEKGENGDLK,ph,S,340,true,"atm and atr DNA damage response",88,25561503,"MASCOT Score",25.0000000,1.0000000,,,,,-0.3600000
GSLGSPEKGENGDLK,ph,S,340,true,"Col-0 callus - FC Col-0 vs. Col-0 Xray",111a,31410901,,47.4000000,,1.3560477,0.0000000,NO,,0.6460954
GSLGSPEKGENGDLK,ph,S,340,true,"Col-0 X-ray callus - FC Col-0 vs. Col-0 Xray",111b,31410901,,47.4000000,,1.3560477,0.0000000,NO,,0.6460954
GSLGSPEKGENGDLK,ph,S,340,true,"atm callus - FC atm vs. atm Xray",111c,31410901,,47.4000000,,0.2887464,0.0000000,NO,,0.6460954
GSLGSPEKGENGDLK,ph,S,340,true,"atm-3 X-ray callus - FC atm vs. atm Xray",111d,31410901,,47.4000000,,0.2887464,0.0000000,NO,,0.6460954
GSLGSPEK,ph,S,340,true,"atm and atr DNA damage response",88,25561503,"MASCOT Score",34.0000000,1.0000000,,,,,-0.2800000
FLQVSNLSPSLTTEQLR,ph,S,359,true,"Tissue atlas Arabidopsis - ProteomicsDB",114,32188942,"MaxQuant score",119.8000000,0.9956920,,,,4.741660189489E-12,
SKSKSPISYR,ph,S,519,true,"Phospho cell culture sucrose/TOR",109,30833711,,,1.0000000,,,,,
SKSKSPISYR,ph,S,519,true,"Tissue atlas Arabidopsis - ProteomicsDB",114,32188942,"MaxQuant score",93.4780000,1.0000000,,,,0.0012137399753556,
SKSKSPISYR,ph,S,521,true,"Tissue atlas Arabidopsis - ProteomicsDB",114,32188942,"MaxQuant score",93.4780000,0.9999990,,,,0.0012137399753556,
SKSPISYR,ph,S,523,true,"Phospho cell culture sucrose/TOR",109,30833711,,,0.9999960,,,,,
SKSPISYR,ph,S,523,true,"Tissue atlas Arabidopsis - ProteomicsDB",114,32188942,"MaxQuant score",93.4780000,0.9999370,,,,0.0012137399753556,
RRSPTYSPPFR,ph,S,533,true,"SnRK2 protein kinase substrates",85,23776212,XCorr,2.0883956,0.9930000,,,,0.028650199994445,
RRSPTYSPPFR,ph,S,533,true,"atm and atr DNA damage response",88,25561503,"MASCOT Score",54.0000000,1.0000000,,,,,-0.6000000
RRSPTYSPPFR,ph,S,533,true,"TOR Kinase and ABA Receptor",100,29290610,XCorr,3.5044835,0.9999000,,,,1.4889999874867E-5,
RRSPTYSPPFR,ph,S,533,true,"Phospho cell culture sucrose/TOR",109,30833711,,,0.9989550,,,,,
RSPTYSPPFR,ph,S,533,true,"atm and atr DNA damage response",88,25561503,"MASCOT Score",39.0000000,1.0000000,,,,,-0.0600000
RSPTYSPPFR,ph,S,533,true,"Tissue atlas Arabidopsis - ProteomicsDB",114,32188942,"MaxQuant score",163.5900000,0.9994640,,,,8.3091603301E-5,
SPTYSPPFR,ph,S,533,true,"Tyrosine phosphorylation in Arabidopsis",59,18463617,"MASCOT Score",35.0000000,,,,,,-0.0884580
SPTYSPPFR,ph,S,533,true,"atm and atr DNA damage response",88,25561503,"MASCOT Score",26.0000000,1.0000000,,,,,-0.1800000
RRSPTYSPPFR,ph,T,535,true,"SnRK2 protein kinase substrates",85,23776212,XCorr,2.0883956,0.9260000,,,,0.028650199994445,
RRSPTYSPPFR,ph,T,535,true,"atm and atr DNA damage response",88,25561503,"MASCOT Score",20.0000000,1.0000000,,,,,0.1300000
RRSPTYSPPFR,ph,T,535,true,"Phospho cell culture sucrose/TOR",109,30833711,,,0.9933640,,,,,
RSPTYSPPFR,ph,T,535,true,"atm and atr DNA damage response",88,25561503,"MASCOT Score",39.0000000,1.0000000,,,,,-0.0600000
SPTYSPPFR,ph,T,535,true,"Tyrosine phosphorylation in Arabidopsis",59,18463617,"MASCOT Score",45.0000000,,,,,,-1.6807052
SPTYSPPFR,ph,T,535,true,"atm and atr DNA damage response",88,25561503,"MASCOT Score",25.0000000,1.0000000,,,,,-0.3700000
SPTYSPPFR,ph,T,535,true,"Tissue atlas Arabidopsis - ProteomicsDB",114,32188942,"MaxQuant score",187.2300000,0.9925720,,,,6.9861897600276E-7,
RRSPTYSPPFR,ph,S,537,true,"SnRK2 protein kinase substrates",85,23776212,XCorr,2.0883956,0.9930000,,,,0.028650199994445,
RRSPTYSPPFR,ph,S,537,true,"atm and atr DNA damage response",88,25561503,"MASCOT Score",20.0000000,0.9900000,,,,,0.1300000
RSPTYSPPFR,ph,S,537,true,"atm and atr DNA damage response",88,25561503,"MASCOT Score",39.0000000,0.9940000,,,,,-0.0600000
SPTYSPPFR,ph,S,537,true,"Conserved plant phosphoproteome - Arabidopsis",61a,20466843,"MASCOT Score",45.0000000,1.0000000,,,,,
SPTYSPPFR,ph,S,537,true,"Phospho cell culture sucrose/TOR",109,30833711,,,0.9995380,,,,,
SPTYSPPFR,ph,S,537,true,"Tissue atlas Arabidopsis - ProteomicsDB",114,32188942,"MaxQuant score",163.5900000,0.9999980,,,,0.00010365000343882,
SYRDSRDISESR,ph,S,570,true,"atm and atr DNA damage response",88,25561503,"MASCOT Score",28.0000000,1.0000000,,,,,-0.1300000
SRSRSVEDSADIK,ph,S,657,true,"Tissue atlas Arabidopsis - ProteomicsDB",114,32188942,"MaxQuant score",65.3460000,0.9997340,,,,0.0073237200267613,
SRSVEDSADIKDK,ph,S,659,true,"STN8 phosphoproteome",38,21768351,"MASCOT Score",45.8000000,,,,,,
SRSVEDSADIKDK,ph,S,659,true,"Chloroplast kinase substrates",60,19376835,"MASCOT Score",46.3900000,,,,,,0.0214928
SRSVEDSADIKDK,ph,S,659,true,"Phospho cell culture sucrose/TOR",109,30833711,,,1.0000000,,,,,
SRSVEDSADIKDK,ph,S,659,true,"Tissue atlas Arabidopsis - ProteomicsDB",114,32188942,"MaxQuant score",150.7200000,1.0000000,,,,3.326540110038E-8,
SRSVEDSADIK,ph,S,659,true,"LAXIC - mannitol vs control",84b,23660473,XCorr,2.3900000,0.9990000,,,,0.0024825700093061,
SRSVEDSADIKDK,ph,S,661,true,"Chloroplast kinase substrates",60,19376835,"MASCOT Score",46.3900000,,,,,,0.0214928
SVEDSADIKDK,ph,S,661,true,"STN8 phosphoproteome",38,21768351,"MASCOT Score",70.8000000,,,,,,-1.0216100
SVEDSADIKDK,ph,S,661,true,"Chloroplast kinase substrates",60,19376835,"MASCOT Score",38.6600000,,,,,,0.2055190
SVEDSADIKDK,ph,S,661,true,"SnRK2 protein kinase substrates",85,23776212,XCorr,2.2682900,1.0000000,,,,0.1052929982543,
SVEDSADIKDK,ph,S,661,true,"Phospho cell culture sucrose/TOR",109,30833711,,,1.0000000,,,,,
SVEDSADIKDK,ph,S,661,true,"Tissue atlas Arabidopsis - ProteomicsDB",114,32188942,"MaxQuant score",204.4800000,1.0000000,,,,3.7480899698581E-24,
SRSVEDSADIK,ph,S,661,true,"LAXIC - mannitol vs control",84b,23660473,XCorr,2.3900000,1.0000000,,,,0.0024825700093061,
SVEDSADIK,ph,S,661,true,"LAXIC - mannitol vs control",84b,23660473,XCorr,2.5400000,0.9990000,,,,0.17880600690842,
SVEDSADIKDK,ph,S,665,true,"Tissue atlas Arabidopsis - ProteomicsDB",114,32188942,"MaxQuant score",155.0900000,1.0000000,,,,1.5433700151224E-10,
DTSRNSDEAK,ph,S,702,true,"atm and atr DNA damage response",88,25561503,"MASCOT Score",40.0000000,0.9970000,,,,,1.1300000
SRSLENDNGSHENVDVAQDNDLNSR,ph,S,715,true,"LAXIC - mannitol vs control",84b,23660473,XCorr,4.3600000,1.0000000,1.2091610,,NO,0.00051293097203597,
SRSLENDNGSHENVDVAQDNDLNSR,ph,S,715,true,"atm and atr DNA damage response",88,25561503,"MASCOT Score",50.0000000,1.0000000,,,,,-0.0200000
SRSLENDNGSHENVDVAQDNDLNSR,ph,S,715,true,"Phospho cell culture sucrose/TOR",109,30833711,,,0.9999470,,,,,
SRSLENDNGSHENVDVAQDNDLNSR,ph,S,715,true,"Tissue atlas Arabidopsis - ProteomicsDB",114,32188942,"MaxQuant score",183.2700000,1.0000000,,,,0,
SRSLENDNGSHENVDVAQDNDLNSR,ph,S,717,true,"LAXIC - mannitol vs control",84b,23660473,XCorr,4.3600000,0.9990000,1.2091610,,NO,0.00051293097203597,
SRSLENDNGSHENVDVAQDNDLNSR,ph,S,717,true,"atm and atr DNA damage response",88,25561503,"MASCOT Score",50.0000000,1.0000000,,,,,-0.0200000
SRSLENDNGSHENVDVAQDNDLNSR,ph,S,717,true,"Tissue atlas Arabidopsis - ProteomicsDB",114,32188942,"MaxQuant score",237.3500000,1.0000000,,,,0,
SLENDNGSHENVDVAQDNDLNSR,ph,S,717,true,"STN8 phosphoproteome",38,21768351,"MASCOT Score",100.3500000,,,,,,-1.3882600
SLENDNGSHENVDVAQDNDLNSR,ph,S,717,true,"Chloroplast kinase substrates",60,19376835,"MASCOT Score",93.7900000,,,,,,-1.3882600
SLENDNGSHENVDVAQDNDLNSR,ph,S,717,true,"srk2dei ABA signaling phopshoproteomics",83,23572148,"MASCOT Score",55.0000000,,,,,,0.0000000
SLENDNGSHENVDVAQDNDLNSR,ph,S,717,true,"atm and atr DNA damage response",88,25561503,"MASCOT Score",44.0000000,1.0000000,,,,,-0.2700000
SRSLENDNGSHENVDVAQDNDLNSR,ph,S,724,true,"Tissue atlas Arabidopsis - ProteomicsDB",114,32188942,"MaxQuant score",90.9990000,1.0000000,,,,1.8639400461463E-14,
SLENDNGSHENVDVAQDNDLNSR,ph,S,724,true,"srk2dei ABA signaling phopshoproteomics",83,23572148,"MASCOT Score",55.0000000,,,,,,0.0000000
SLENDNGSHENVDVAQDNDLNSR,ph,S,724,true,"atm and atr DNA damage response",88,25561503,"MASCOT Score",44.0000000,1.0000000,,,,,-0.2700000
SKSLDEDYDMKER,ph,S,745,true,"Phospho cell culture sucrose/TOR",109,30833711,,,1.0000000,,,,,
SKSLDEDYDMKER,ph,S,745,true,"Tissue atlas Arabidopsis - ProteomicsDB",114,32188942,"MaxQuant score",197.1700000,1.0000000,,,,2.9737099594299E-18,
SKSLDEDYDMK,ph,S,745,true,"Tyrosine phosphorylation in Arabidopsis",59,18463617,"MASCOT Score",55.0000000,,,,,,-1.0641765
SKSLDEDYDMK,ph,S,745,true,"LAXIC - mannitol vs control",84b,23660473,XCorr,3.5600000,1.0000000,1.6888633,,NO,8.3800000538758E-7,
SKSLDEDYDMK,ph,S,745,true,"atm and atr DNA damage response",88,25561503,"MASCOT Score",28.0000000,1.0000000,,,,,-1.4500000
SKSLDEDYDMKER,ph,S,747,true,"atm and atr DNA damage response",88,25561503,"MASCOT Score",27.0000000,1.0000000,,,,,1.7800000
SKSLDEDYDMK,ph,S,747,true,"Tyrosine phosphorylation in Arabidopsis",59,18463617,"MASCOT Score",69.0000000,,,,,,-0.3547252
SKSLDEDYDMK,ph,S,747,true,"Conserved plant phosphoproteome - Arabidopsis",61a,20466843,"MASCOT Score",55.0000000,1.0000000,,,,,
SKSLDEDYDMK,ph,S,747,true,"LAXIC - mannitol vs control",84b,23660473,XCorr,3.5600000,1.0000000,1.6888633,,NO,8.3800000538758E-7,
SKSLDEDYDMK,ph,S,747,true,"atm and atr DNA damage response",88,25561503,"MASCOT Score",49.0000000,1.0000000,,,,,1.8700000
SLDEDYDMKER,ph,S,747,true,"Tissue atlas Arabidopsis - ProteomicsDB",114,32188942,"MaxQuant score",240.4600000,1.0000000,,,,0,
SLDEDYDMK,ph,S,747,true,"Tyrosine phosphorylation in Arabidopsis",59,18463617,"MASCOT Score",58.0000000,,,,,,-0.7535074
SLDEDYDMK,ph,S,747,true,"srk2dei ABA signaling phopshoproteomics",83,23572148,"MASCOT Score",62.0000000,,,,,,-0.0001000
SLDEDYDMK,ph,S,747,true,"atm and atr DNA damage response",88,25561503,"MASCOT Score",61.0000000,1.0000000,,,,,-0.4100000
SLDEDYDMK,ph,S,747,true,"TOR Kinase and ABA Receptor",100,29290610,XCorr,3.2124581,1.0000000,,,,0.00024590000975877,
SRSRSLETK,ph,S,761,true,"atm and atr DNA damage response",88,25561503,"MASCOT Score",23.0000000,1.0000000,,,,,-1.5200000
SRSRSLETK,ph,S,763,true,"atm and atr DNA damage response",88,25561503,"MASCOT Score",23.0000000,1.0000000,,,,,-1.5200000
SRSRSLETK,ph,S,765,true,"atm and atr DNA damage response",88,25561503,"MASCOT Score",23.0000000,0.9860000,,,,,-1.5200000
DIRSSPGYSDEKK,ph,S,836,true,"Tissue atlas Arabidopsis - ProteomicsDB",114,32188942,"MaxQuant score",111.5800000,0.9999880,,,,4.0412098314846E-5,
DIRSSPGYSDEK,ph,S,836,true,"TOR Kinase and ABA Receptor",100,29290610,XCorr,3.0518718,0.9094000,,,,0.0337999984622,
DIRSSPGYSDEKK,ph,S,837,true,"Tissue atlas Arabidopsis - ProteomicsDB",114,32188942,"MaxQuant score",111.5800000,0.9999900,,,,4.0412098314846E-5,
DIRSSPGYSDEK,ph,S,837,true,"TOR Kinase and ABA Receptor",100,29290610,XCorr,4.0611568,0.9073000,,,,0.00030750001315027,
DIRSSPGYSDEK,ph,S,837,true,"Phospho cell culture sucrose/TOR",109,30833711,,,0.9214020,,,,,
SSPGYSDEKK,ph,S,837,true,"atm and atr DNA damage response",88,25561503,"MASCOT Score",38.0000000,0.9600000,,,,,-0.6100000
SSPGYSDEK,ph,S,837,true,"atm and atr DNA damage response",88,25561503,"MASCOT Score",44.0000000,0.9540000,,,,,-1.3000000
DIRSSPGYSDEKK,ph,S,841,true,"Tissue atlas Arabidopsis - ProteomicsDB",114,32188942,"MaxQuant score",101.5400000,0.9999610,,,,0.000127726001665,
DIRSSPGYSDEK,ph,S,841,true,"Phospho cell culture sucrose/TOR",109,30833711,,,1.0000000,,,,,
SSPGYSDEKK,ph,S,841,true,"atm and atr DNA damage response",88,25561503,"MASCOT Score",30.0000000,0.9980000,,,,,-1.1700000
SSPGYSDEK,ph,S,841,true,"atm and atr DNA damage response",88,25561503,"MASCOT Score",44.0000000,0.9540000,,,,,-1.3000000
RGDRSLSPVSSEDHK,ph,S,889,true,"Phospho cell culture sucrose/TOR",109,30833711,,,1.0000000,,,,,
GDRSLSPVSSEDHK,ph,S,889,true,"Large-scale phosphorylation discovery",44,23111157,XCorr,3.0390000,,,,,,
GDRSLSPVSSEDHK,ph,S,889,true,"atm and atr DNA damage response",88,25561503,"MASCOT Score",41.0000000,1.0000000,,,,,0.5700000
SLSPVSSEDHKIK,ph,S,889,true,"Tissue atlas Arabidopsis - ProteomicsDB",114,32188942,"MaxQuant score",146.3700000,1.0000000,,,,9.6523699255613E-8,
SLSPVSSEDHK,ph,S,889,true,"atm and atr DNA damage response",88,25561503,"MASCOT Score",29.0000000,1.0000000,,,,,-1.5600000
GDRSLSPVSSEDHK,ph,S,891,true,"atm and atr DNA damage response",88,25561503,"MASCOT Score",41.0000000,1.0000000,,,,,0.5700000
SLSPVSSEDHK,ph,S,891,true,"atm and atr DNA damage response",88,25561503,"MASCOT Score",29.0000000,1.0000000,,,,,-1.5600000
SLSPVSSEDHK,ph,S,891,true,"Tissue atlas Arabidopsis - ProteomicsDB",114,32188942,"MaxQuant score",146.3700000,1.0000000,,,,9.6523699255613E-8,
RGDRSLSPVSSEDHK,ph,S,894,true,"Tissue atlas Arabidopsis - ProteomicsDB",114,32188942,"MaxQuant score",97.7670000,1.0000000,,,,0.00033282401273027,
RGDRSLSPVSSEDHK,ph,S,895,true,"Tissue atlas Arabidopsis - ProteomicsDB",114,32188942,"MaxQuant score",146.3700000,1.0000000,,,,9.6523699255613E-8,
EKPHSDYEK,ph,S,916,true,"atm and atr DNA damage response",88,25561503,"MASCOT Score",28.0000000,1.0000000,,,,,-2.4900000
VDDGDANSDSSQQERNLEGHLLSLDSMSSQDVEK,ph,S,928,true,"Brassinosteroid-Regulated Phosphorylation Dynamics",94,26187819,"MaxQuant Score",79.9110000,0.9340000,,,,2.2019999050826E-6,-1.5620000
VDDGDANSDSSQQER,ph,S,928,true,"atm and atr DNA damage response",88,25561503,"MASCOT Score",73.0000000,0.9660000,,,,,-0.0800000
VDDGDANSDSSQQER,ph,S,928,true,"Tissue atlas Arabidopsis - ProteomicsDB",114,32188942,"MaxQuant score",233.3100000,0.9999780,,,,0,
VDDGDANSDSSQQERNLEGHLLSLDSMSSQDVEK,ph,S,930,true,"Brassinosteroid-Regulated Phosphorylation Dynamics",94,26187819,"MaxQuant Score",79.9110000,0.7540000,,,,2.2019999050826E-6,-0.2060000
VDDGDANSDSSQQER,ph,S,930,true,"atm and atr DNA damage response",88,25561503,"MASCOT Score",58.0000000,0.9940000,,,,,0.0100000
VDDGDANSDSSQQERNLEGHLLSLDSMSSQDVEK,ph,S,931,true,"Brassinosteroid-Regulated Phosphorylation Dynamics",94,26187819,"MaxQuant Score",79.9110000,0.8580000,,,,2.2019999050826E-6,-1.5950000
VDDGDANSDSSQQER,ph,S,931,true,"atm and atr DNA damage response",88,25561503,"MASCOT Score",50.0000000,0.9980000,,,,,-1.9600000
SMSSQDVE,nt,S,946,false,"Arg/N-end rule seed, prt6 vs. Wt",99,29168982,"MASCOT Score",50.5500000,,-0.6804360,0.0386288,NO,0.035250000655651,0.7042068
NLEGHLLSLDSMSSQDVEK,ph,S,946,true,"TOR Kinase and ABA Receptor",100,29290610,XCorr,3.8117607,0.9767000,,,,0.015469999983907,
NLEGHLLSLDSMSSQDVEK,ph,S,946,true,"Phospho cell culture sucrose/TOR",109,30833711,,,0.9667020,,,,,
NLEGHLLSLDSMSSQDVEK,ph,S,946,true,"Tissue atlas Arabidopsis - ProteomicsDB",114,32188942,"MaxQuant score",245.0900000,0.9939580,,,,0,
NLEGHLLSLDSMSSQDVEK,ph,S,948,true,"Tissue atlas Arabidopsis - ProteomicsDB",114,32188942,"MaxQuant score",235.6500000,0.8532410,,,,0,
SKENPPSSSSVERGDANDDEK,ph,S,961,true,"Tissue atlas Arabidopsis - ProteomicsDB",114,32188942,"MaxQuant score",131.9600000,0.9380740,,,,7.9155998586625E-21,
ENPPSSSSVERGDANDDEK,ph,S,961,true,"atm and atr DNA damage response",88,25561503,"MASCOT Score",44.0000000,0.9800000,,,,,0.3400000
SKENPPSSSSVER,ph,S,963,true,"Tissue atlas Arabidopsis - ProteomicsDB",114,32188942,"MaxQuant score",217.3200000,0.7817980,,,,0,
SKENPPSSSSVER,ph,S,964,true,"SnRK2 protein kinase substrates",85,23776212,XCorr,2.4155579,0.9220000,,,,0.0032766601070762,
SKENPPSSSSVER,ph,S,964,true,"atm and atr DNA damage response",88,25561503,"MASCOT Score",39.0000000,0.9070000,,,,,-0.5400000
SKENPPSSSSVER,ph,S,964,true,"Tissue atlas Arabidopsis - ProteomicsDB",114,32188942,"MaxQuant score",217.3200000,0.9751330,,,,0,
ENPPSSSSVER,ph,S,964,true,"atm and atr DNA damage response",88,25561503,"MASCOT Score",49.0000000,0.9430000,,,,,0.0300000
