Peptide,PTM,ModifiedAA,ModifiedPosition,PeptideUniqueToGene,ExperimentDesc,ExpID,PubmedID,ScoreType,IdentScore,LocProb,Log2FChange,PQ-val,QuantSig,PEP,MassErrorPPM
DDQTAMLALAKSFNPPPSDWSSTTD,nt,D,25,true,"HUNTER N-terminome: legumain, GluC and trypsin",119,31951383,"MaxQuant score",51.8570000,,,,,,
DDQTAMLALAKSFN,nt,D,25,true,"HUNTER N-terminome: legumain, GluC and trypsin",119,31951383,"MaxQuant score",97.9110000,,,,,,
SFNPPPSDWSSTTDFCK,sno,C,51,true,"hot5-4 / wildtype, FAT-switch S-nitrosoproteome",169,37277371,,,,0.0549339,0.4162336,NO,,
LSYNNITGVLPPSLGK,ng,N,193,true,"N-linked Glycan Micro-heterogeneity Arabidopsis",134,29237727,,,,,,,,
LSYNNITGVLPPSLGK,ng,N,193,true,"UDP-GlcNAc transporter glycopeptide analysis",135,30224661,,,,,,,1.878052885597E-15,0.3000000
NISLDNNK,ng,N,281,true,"Conserved N-glycosylation",74,22633491,"MaxQuant Score",90.1030000,1.0000000,,,,0.014999999664724,-0.3530000
HGFTGFISPAIANLTSLK,ng,N,383,true,"Conserved N-glycosylation",74,22633491,"MaxQuant Score",132.9300000,1.0000000,,,,3.0429999842113E-19,0.1360000
GGFGVVYAGELHDGTKTAVK,ph,T,601,true,"Phosphorylation in N starvation",63,22060019,"MASCOT Score",99.0000000,,,,,,-1.1535100
GVEYLHSLAQQSFIHR,ph,S,702,true,"Tissue atlas Arabidopsis - ProteomicsDB",114,32188942,"MaxQuant score",215.0800000,1.0000000,,,,0,
NAPDGKYSVETR,ph,S,738,true,"atm and atr DNA damage response",88,25561503,"MASCOT Score",21.0000000,0.9940000,,,,,-0.8700000
NAPDGKYSVETR,ph,S,738,true,"Tissue atlas Arabidopsis - ProteomicsDB",114,32188942,"MaxQuant score",104.0300000,0.9985790,,,,0.00018795300275087,
NAPDGKYSVETR,ph,T,741,true,"atm and atr DNA damage response",88,25561503,"MASCOT Score",21.0000000,1.0000000,,,,,-0.8700000
VAELAGHCTAR,so,C,836,true,"Arabidopsis S-sulfenylation chemoproteomics",108,31578252,"pFind PSM Score",0.0373841,,0.9434000,,,,-0.8674288
ASGFPNTFDSADGR,ph,T,921,true,"Tissue atlas Arabidopsis - ProteomicsDB",114,32188942,"MaxQuant score",169.3700000,0.9998770,,,,3.2534800201834E-15,
ASGFPNTFDSADGR,ph,S,924,true,"Tissue atlas Arabidopsis - ProteomicsDB",114,32188942,"MaxQuant score",155.2600000,0.9999840,,,,2.5162799621725E-10,
