Peptide,PTM,ModifiedAA,ModifiedPosition,PeptideUniqueToGene,ExperimentDesc,ExpID,PubmedID,ScoreType,IdentScore,LocProb,Log2FChange,PQ-val,QuantSig,PEP,MassErrorPPM
AETANTDLEGIDGVR,nt,A,2,true,"Arg/N-end rule seed, prt6 vs. Wt",99,29168982,"MASCOT Score",95.3500000,,,,,0.00023869999859016,-1.7446186
AETANTDLEG,nt,A,2,true,"N-term acetylation drought responses",5,26184543,,,,,,,,
AETANTDLEGIDGVR,nta,A,2,true,"Characterization plant N-terminal acetylation",6,22223895,"MASCOT Score",95.9200000,,,,,,
AETANTDLEGIDGVR,nta,A,2,true,"Arg/N-end rule pathway Roots",80,25728785,"MASCOT Score",53.1200000,,,,,9.5260002126452E-6,
AETANTDLEGIDGVR,nta,A,2,true,"Arg/N-end rule seed, prt6 vs. Wt",99,29168982,"MASCOT Score",95.3500000,,,,,0.00023869999859016,-1.7446186
AETANTDLEGIDGVR,nta,A,2,true,"HUNTER N-terminome: legumain, GluC and trypsin",119,31951383,"MaxQuant score",285.9400000,,,,,,
AETANTDLEGIDGVR,nta,A,2,true,"Arabidopsis translation initiation landscape - NTA",167a,35069635,,,,,,,,
AETANTDLEG,nta,A,2,true,"N-term acetylation drought responses",5,26184543,,,,,,,,
AETANTDLEGIDGVR,ph,T,4,true,"Lateral root-induction - NAA vs control",106,23328941,"MASCOT Score",31.0000000,,,,,,
GGSKGPQNGFPSSGLNR,ph,S,217,true,"Tissue atlas Arabidopsis - ProteomicsDB",114,32188942,"MaxQuant score",50.9440000,0.9999660,,,,0.0062903100624681,
DLDKDAAPYYK,ub,K,321,false,"upl3 mutant / wildtype",168,35926874,"MaxQuant score",81.0170000,1.0000000,0.2363395,,,0.0015791900223121,-0.1928800
VTTVCR,so,C,503,true,"Arabidopsis S-sulfenylation chemoproteomics",108,31578252,"pFind PSM Score",0.2157480,,1.3799000,,,,0.4779993
LVVCDQHGSQAR,sno,C,711,false,"Site-specific nitrosomeproteomic id - gsnor1-3",90a,25699590,XCorr,3.9673533,,,,,8.7349999375874E-6,-6.7144502
LVVCDQHGSQAR,sno,C,711,false,"Site-specific nitrosomeproteomic id - gsnor1-3",90b,25699590,XCorr,3.5300000,,,,,0.028489999473095,-6.9200000
LVVCDQHGSQAR,sno,C,711,false,"hot5-4 / wildtype, FAT-switch S-nitrosoproteome",169,37277371,,,,,,,,
LVVCDQHGSQAR,so,C,711,false,"Arabidopsis S-sulfenylation chemoproteomics",108,31578252,"pFind PSM Score",0.0001570,,1.3018100,,,,-1.5293762
LVVCDQHGSQAR,so,C,711,false,"S-sulfenylation site detection using YAP1C",110,32714340,,,,,,,,
LVVCDQHGSQAR,ph,S,716,false,"Phospho cell culture sucrose/TOR",109,30833711,,,1.0000000,,,,,
LVVCDQHGSQAR,ph,S,716,false,"Tissue atlas Arabidopsis - ProteomicsDB",114,32188942,"MaxQuant score",131.3500000,1.0000000,,,,3.6464698496275E-5,
