Peptide,PTM,ModifiedAA,ModifiedPosition,PeptideUniqueToGene,ExperimentDesc,ExpID,PubmedID,ScoreType,IdentScore,LocProb,Log2FChange,PQ-val,QuantSig,PEP,MassErrorPPM
ASSSSSPSPDLDSSSSSSSSQVL,nt,A,48,true,"Arabidopsis translation initiation landscape - NT",167b,35069635,,,,,,,,
SSSSSPSPDLDSSSSSSSSQVLLSPNGTGAVKSDER,nt,S,49,true,"Arg/N-end rule pathway Roots",80,25728785,"MASCOT Score",108.2100000,,,,,1.6049999658208E-6,
SSSSSPSPDLDSSSSSSSSQVLLSPNGTGAVKSDER,nt,S,49,true,"Stromal N-terminome",96,26371235,"MASCOT Score",51.2800000,,,,,,
SSSSSPSPDLDSSSSSSSSQVLLSPNGTGAVKSDER,nt,S,49,true,"HUNTER N-terminome: legumain, GluC and trypsin",119,31951383,"MaxQuant score",144.6700000,,,,,,
SSSSSPSPDLDSSSSSSSSQVLLSPNGTGAVKSDE,nt,S,49,true,"HUNTER N-terminome: legumain, GluC and trypsin",119,31951383,"MaxQuant score",119.8900000,,,,,,
SSSSSPSPDLDSSSSSSSSQVL,nt,S,49,true,"Arabidopsis translation initiation landscape - NT",167b,35069635,,,,,,,,
AVTTDTSGIEVDTVTEAELKENGFR,nt,A,90,true,"HUNTER N-terminome: legumain, GluC and trypsin",119,31951383,"MaxQuant score",78.4890000,,,,,,
AVTTDTSGIEVDTVTEAELKENGFR,nt,A,90,true,"Arabidopsis translation initiation landscape - NT",167b,35069635,,,,,,,,
AVTTDTSGIEVDTVTE,nt,A,90,true,"N-terminal ChaFRADIC",92,26010716,"MASCOT Score",99.0200000,,,,,6.1050002386764E-8,
AVTTDTSGIE,nt,A,90,true,"N-terminal ChaFRADIC",92,26010716,"MASCOT Score",75.1700000,,,,,0.00071749999187887,
TIGPATCGFE,nt,T,124,true,"Arg/N-end rule seed, prt6 vs. Wt",99,29168982,"MASCOT Score",31.0200000,,-0.1022929,0.6063225,NO,0.042029999196529,-3.2509659
LNMCHGTR,ox,C,151,true,"OxiTRAQ Arabidopsis - 5 mM H2O2 versus control",47,24376095,,,,1.1283599,0.0029522,YES,,
LNMCHGTR,so,C,151,true,"Arabidopsis S-sulfenylation chemoproteomics",108,31578252,"pFind PSM Score",0.3054230,,,,,,0.6987485
TISVSYDGFAEDVR,ph,S,223,true,"Tissue atlas Arabidopsis - ProteomicsDB",114,32188942,"MaxQuant score",137.9300000,0.9998370,,,,1.4183199709805E-5,
CLCTDPGLLLPR,ox,C,260,true,"SPEAR - 10 mM H2O2 / mock",138a,34619326,,,,3.9534858,0.0004018,YES,,
IVQVCR,sno,C,391,false,"hot5-4 / wildtype, FAT-switch S-nitrosoproteome",169,37277371,,,,,,,,
IVQVCR,so,C,391,false,"Arabidopsis S-sulfenylation chemoproteomics",108,31578252,"pFind PSM Score",0.1384390,,,,,,0.4809211
AEVADVSEAVR,nt,A,417,true,"Arg/N-end rule pathway Roots",80,25728785,"MASCOT Score",36.5500000,,,,,0.005557999946177,
SDALMLSGESAMGQFPDKALTVLR,nt,S,430,true,"Arabidopsis translation initiation landscape - NT",167b,35069635,,,,,,,,
SVPLQAIGSSFSDKISEE,nt,S,471,true,"N-terminal ChaFRADIC",92,26010716,"MASCOT Score",29.0900000,,,,,2.5340000320284E-6,
SVPLQAIG,nt,S,471,true,"N-terminal ChaFRADIC",92,26010716,"MASCOT Score",37.0900000,,,,,0.11930000036955,
ISEEICNSAAK,sno,C,490,true,"hot5-4 / wildtype, FAT-switch S-nitrosoproteome",169,37277371,,,,-0.1152240,0.5921579,NO,,
ISEEICNSAAK,so,C,490,true,"S-sulfenylation site detection using YAP1C",110,32714340,,,,,,,,
TFSLLKSR,ac,K,569,true,"Quantitative Acetylproteomics",101,29440448,,,,,,,,
