Peptide,PTM,ModifiedAA,ModifiedPosition,PeptideUniqueToGene,ExperimentDesc,ExpID,PubmedID,ScoreType,IdentScore,LocProb,Log2FChange,PQ-val,QuantSig,PEP,MassErrorPPM
FHVKSVPSEFR,nt,F,67,true,"Mitochondrial intermediate peptidases - oct1-2 / WT",131c,25732537,,44.0700000,,6.6438562,,,,
GKNPQCLVLAPTR,so,C,193,true,"S-sulfenylation site detection using YAP1C",110,32714340,,,,,,,,
NPQCLVLAPTR,so,C,193,true,"Arabidopsis S-sulfenylation chemoproteomics",108,31578252,"pFind PSM Score",0.0082243,,0.8695700,,,,1.3277787
ESAPSLDTICLYGGTPIGQQMR,ox,C,221,false,"Redox kickstart of mitochondria",112,31871212,,,,-1.6497456,0.0083430,YES,,
ESAPSLDTICLYGGTPIGQQMR,ox,C,221,false,"SPEAR - 10 mM H2O2 / mock",138a,34619326,,,,0.8646306,0.0346737,YES,,
ESAPSLDTICLYGGTPIGQQMR,so,C,221,false,"S-sulfenylation site detection using YAP1C",110,32714340,,,,,,,,
IIDLMKR,ub,K,254,true,"Arabidopsis ubiquitination COFRADIC",40,26744219,"MaxQuant Score",68.9150000,1.0000000,,,,0.012000000104308,0.6400000
CIVFTQTK,ox,C,364,false,"Redox kickstart of mitochondria",112,31871212,,,,-1.1479732,0.0000045,YES,,
CIVFTQTKR,so,C,364,false,"S-sulfenylation site detection using YAP1C",110,32714340,,,,,,,,
SGGGSYGGYGGSSGR,nt,S,530,true,"Arabidopsis translation initiation landscape - NT",167b,35069635,,,,,,,,
SSGFGSFGSGGSSGGFGSDR,ph,S,574,true,"Conserved plant phosphoproteome - Arabidopsis",61a,20466843,"MASCOT Score",56.0000000,1.0000000,,,,,
SSGFGSFGSGGSSGGFGSDR,ph,S,574,true,"Phospho cell culture sucrose/TOR",109,30833711,,,0.9126020,,,,,
SSFGGFGSNDGKR,ac,K,607,false,"Quantitative Acetylproteomics",101,29440448,,,,,,,,
SSFGGFGSNDGKR,ub,K,607,false,"Arabidopsis ubiquitination COFRADIC",40,26744219,"MaxQuant Score",110.8000000,1.0000000,,,,3.2739998591987E-14,-0.2610000
