Peptide,PTM,ModifiedAA,ModifiedPosition,PeptideUniqueToGene,ExperimentDesc,ExpID,PubmedID,ScoreType,IdentScore,LocProb,Log2FChange,PQ-val,QuantSig,PEP,MassErrorPPM
SDSRDLYNFVR,ph,S,4,true,"Tissue atlas Arabidopsis - ProteomicsDB",114,32188942,"MaxQuant score",147.2400000,0.8845080,,,,5.6634601008909E-8,
SDSRDLYNFVR,ph,S,6,true,"srk2dei ABA signaling phopshoproteomics",83,23572148,"MASCOT Score",38.0000000,,,,,,-0.0005000
SDSRDLYNFVR,ph,S,6,true,"atm and atr DNA damage response",88,25561503,"MASCOT Score",43.0000000,1.0000000,,,,,0.0900000
SDSRDLYNFVR,ph,S,6,true,"TOR Kinase and ABA Receptor",100,29290610,XCorr,3.7748804,0.9996000,,,,3.0999999580672E-5,
SDSRDLYNFVR,ph,S,6,true,"Phospho cell culture sucrose/TOR",109,30833711,,,0.9947810,,,,,
SDSRDLYNFVR,ph,S,6,true,"Tissue atlas Arabidopsis - ProteomicsDB",114,32188942,"MaxQuant score",171.9300000,0.9999810,,,,2.8180300974678E-12,
GEGAGLGSLSDMDDLATTFAK,ph,S,76,true,"Phospho cell culture sucrose/TOR",109,30833711,,,0.9302530,,,,,
GEGAGLGSLSDMDDLATTFAK,ph,S,76,true,"Tissue atlas Arabidopsis - ProteomicsDB",114,32188942,"MaxQuant score",191.8900000,0.9998390,,,,0,
EGAGLGSLSDMDDLATTFAK,ph,S,76,false,"Tissue atlas Arabidopsis - ProteomicsDB",114,32188942,"MaxQuant score",233.4900000,0.9999900,,,,0,
GEGAGLGSLSDMDDLATTFAK,ph,S,78,true,"TOR Kinase and ABA Receptor",100,29290610,XCorr,4.3619485,1.0000000,,,,3.8490000076052E-10,
VVTGPKHPGVIGDR,ph,T,95,true,"Tissue atlas Arabidopsis - ProteomicsDB",114,32188942,"MaxQuant score",102.3300000,1.0000000,,,,5.3790401580045E-5,
HPGVIGDRGSGSFSR,ph,S,108,true,"Tissue atlas Arabidopsis - ProteomicsDB",114,32188942,"MaxQuant score",73.6880000,0.9906910,,,,9.7437397926114E-5,
HPGVIGDRGSGSFSR,ph,S,110,true,"Tissue atlas Arabidopsis - ProteomicsDB",114,32188942,"MaxQuant score",49.3400000,0.9557590,,,,0.0019467399688438,
WSSQPQSFAHSK,ph,S,143,true,"Tissue atlas Arabidopsis - ProteomicsDB",114,32188942,"MaxQuant score",153.5200000,0.9999410,,,,4.8390300655399E-9,
WSSQPQSFAHSKPLYR,og,S,147,true,"O-GlcNac Inflorescence Tissue",81,28154133,"MASCOT Score",39.2000000,,,,,,-2.8000000
SPQASPGNLHR,ph,S,192,true,"atm and atr DNA damage response",88,25561503,"MASCOT Score",66.0000000,1.0000000,,,,,0.1800000
SPQASPGNLHR,ph,S,192,true,"Col-0 callus - FC Col-0 vs. Col-0 Xray",111a,31410901,,33.7000000,,-1.9942842,0.0000000,NO,,0.0435766
SPQASPGNLHR,ph,S,192,true,"Col-0 X-ray callus - FC Col-0 vs. Col-0 Xray",111b,31410901,,33.7000000,,-1.9942842,0.0000000,NO,,0.0435766
SPQASPGNLHR,ph,S,192,true,"atm callus - FC atm vs. atm Xray",111c,31410901,,33.7000000,,1.0552550,0.0000000,NO,,0.0435766
SPQASPGNLHR,ph,S,192,true,"atm-3 X-ray callus - FC atm vs. atm Xray",111d,31410901,,33.7000000,,1.0552550,0.0000000,NO,,0.0435766
SPQASPGNLHR,ph,S,192,true,"Tissue atlas Arabidopsis - ProteomicsDB",114,32188942,"MaxQuant score",199.1200000,1.0000000,,,,6.5160098098584E-19,
SPQASPGNLHR,ph,S,196,true,"atm and atr DNA damage response",88,25561503,"MASCOT Score",54.0000000,1.0000000,,,,,0.6300000
SPQASPGNLHR,ph,S,196,true,"Tissue atlas Arabidopsis - ProteomicsDB",114,32188942,"MaxQuant score",150.9000000,1.0000000,,,,1.1709800240567E-8,
APSLPGGSQLTYSAPSPLSNSGFHLSGLSQGPHYGGNLTR,ph,S,205,true,"Tissue atlas Arabidopsis - ProteomicsDB",114,32188942,"MaxQuant score",163.2900000,0.9998220,,,,0,
APSLPGGSQLTYSAPSPLSNSGFHLSGLSQGPHYGGNLTR,ph,S,210,true,"Tissue atlas Arabidopsis - ProteomicsDB",114,32188942,"MaxQuant score",175.8000000,0.9491190,,,,0,
NAIMSQHLLALQQR,ph,S,292,true,"Tissue atlas Arabidopsis - ProteomicsDB",114,32188942,"MaxQuant score",51.2650000,1.0000000,,,,0.0030772599857301,
QSYAQLAALQSQLYSSYPSPSR,ph,S,317,true,"Tissue atlas Arabidopsis - ProteomicsDB",114,32188942,"MaxQuant score",438.0600000,0.9380210,,,,0,
GLSQQTSDAASQK,ph,S,350,true,"Tissue atlas Arabidopsis - ProteomicsDB",114,32188942,"MaxQuant score",155.3400000,1.0000000,,,,7.3791101007359E-10,
GLSQQTSDAASQK,ph,S,354,true,"TOR Kinase and ABA Receptor",100,29290610,XCorr,2.3399453,0.9928000,,,,0.0017170000355691,
GLSQQTSDAASQK,ph,S,354,true,"Lateral root-induction - NAA vs control",106,23328941,"MASCOT Score",35.0000000,,,,,,
GLSQQTSDAASQK,ph,S,354,true,"Phospho cell culture sucrose/TOR",109,30833711,,,0.9745330,,,,,
GLSQQTSDAASQK,ph,S,354,true,"Tissue atlas Arabidopsis - ProteomicsDB",114,32188942,"MaxQuant score",229.9000000,0.9905390,,,,0,
GLSQQTSDAASQKSETGLQFR,ph,S,358,true,"atm and atr DNA damage response",88,25561503,"MASCOT Score",33.0000000,0.9800000,,,,,1.1700000
GLSQQTSDAASQKSETGLQFR,ph,S,358,true,"Tissue atlas Arabidopsis - ProteomicsDB",114,32188942,"MaxQuant score",196.7500000,0.9999960,,,,0,
GLSQQTSDAASQKSETGLQFR,ph,S,361,true,"atm and atr DNA damage response",88,25561503,"MASCOT Score",33.0000000,0.9800000,,,,,1.1700000
GLSQQTSDAASQKSETGLQFR,ph,S,361,true,"Tissue atlas Arabidopsis - ProteomicsDB",114,32188942,"MaxQuant score",210.3100000,0.9873160,,,,0,
SETGLQFR,ph,S,361,true,"srk2dei ABA signaling phopshoproteomics",83,23572148,"MASCOT Score",44.0000000,,,,,,0.0000000
SETGLQFR,ph,S,361,true,"TOR Kinase and ABA Receptor",100,29290610,XCorr,2.5621841,0.9912000,,,,0.0023519999813288,
SETGLQFR,ph,T,363,true,"Tissue atlas Arabidopsis - ProteomicsDB",114,32188942,"MaxQuant score",154.3500000,0.9893900,,,,2.5477399745455E-8,
AISHFYPAQLK,ph,S,415,true,"Tissue atlas Arabidopsis - ProteomicsDB",114,32188942,"MaxQuant score",144.1000000,1.0000000,,,,4.4317800984572E-8,
SRNSSEQHPQVHVDALGK,ph,S,429,true,"TOR Kinase and ABA Receptor",100,29290610,XCorr,4.8684478,0.8811000,,,,1.0739999822817E-7,
SRNSSEQHPQVHVDALGK,ph,S,429,true,"Tissue atlas Arabidopsis - ProteomicsDB",114,32188942,"MaxQuant score",189.0900000,0.7778630,,,,3.5069298942151E-37,
SRNSSEQHPQVHVDALGK,ph,S,432,true,"Phospho cell culture sucrose/TOR",109,30833711,,,0.9517190,,,,,
NSSEQHPQVHVDALGK,ph,S,432,true,"Tissue atlas Arabidopsis - ProteomicsDB",114,32188942,"MaxQuant score",170.1000000,0.8365060,,,,4.6303799946416E-28,
NSSEQHPQVHVDALGK,ph,S,433,true,"Phospho cell culture sucrose/TOR",109,30833711,,,0.9644780,,,,,
NSSEQHPQVHVDALGK,ph,S,433,true,"Tissue atlas Arabidopsis - ProteomicsDB",114,32188942,"MaxQuant score",103.2900000,0.9964050,,,,3.4007399563052E-7,
RPHALLEVDSSPGFNDGSGDHK,ph,S,471,true,"TOR Kinase and ABA Receptor",100,29290610,XCorr,4.7523756,1.0000000,,,,3.8199999607968E-7,
RPHALLEVDSSPGFNDGSGDHK,ph,S,471,true,"Tissue atlas Arabidopsis - ProteomicsDB",114,32188942,"MaxQuant score",117.5200000,0.9999800,,,,1.6507099812507E-28,
QILLEGLATALQLADPFSK,ph,S,544,true,"Large-scale phosphorylation discovery",44,23111157,XCorr,3.2250000,,,,,,
KPSAISESASHAR,ph,S,764,true,"Tissue atlas Arabidopsis - ProteomicsDB",114,32188942,"MaxQuant score",112.3000000,0.9870940,,,,2.256369953102E-5,
KPSAISESASHAR,ph,S,768,true,"Tissue atlas Arabidopsis - ProteomicsDB",114,32188942,"MaxQuant score",116.1300000,0.9625920,,,,1.6705200323486E-5,
GGQINSESVRG,ph,S,779,true,"Tissue atlas Arabidopsis - ProteomicsDB",114,32188942,"MaxQuant score",169.3300000,0.9999780,,,,1.187230001809E-11,
