Peptide,PTM,ModifiedAA,ModifiedPosition,PeptideUniqueToGene,ExperimentDesc,ExpID,PubmedID,ScoreType,IdentScore,LocProb,Log2FChange,PQ-val,QuantSig,PEP,MassErrorPPM
VKFLKQNKAVILLQGR,nt,V,2,false,"Arg/N-end rule pathway Roots",80,25728785,"MASCOT Score",85.0200000,,,,,4.8350000270148E-7,
VKFLKQNKAVILLQGR,nt,V,2,false,"Stromal N-terminome",96,26371235,"MASCOT Score",50.9800000,,,,,,
VKFLKQNKAV,nt,V,2,false,"N-term acetylation drought responses",5,26184543,,,,,,,,
QNKAVILLQGR,ub,K,9,false,"upl3 mutant / wildtype",168,35926874,"MaxQuant score",74.8410000,1.0000000,1.0586628,0.1661250,NO,0.00049481698079035,1.2635000
AVIIKSFDDGTSDRR,ac,K,27,true,"Quantitative Acetylproteomics",101,29440448,,,,,,,,
AVIIKSFDDGTSDR,ac,K,27,true,"Histone deacetylases - apicidin vs control",98a,29061669,"MaxQuant Score",77.8000000,1.0000000,-0.1390000,0.5482770,NO,0.00015999999595806,
AVIIKSFDDGTSDR,ac,K,27,true,"Quantitative Acetylproteomics",101,29440448,,,,,,,,
YGHCLVAGLK,so,C,41,false,"S-sulfenylation site detection using YAP1C",110,32714340,,,,,,,,
KYPSKVIR,ac,K,52,false,"Quantitative Acetylproteomics",101,29440448,,,,,,,,
EVATLDALK,ph,T,96,true,"SIRK1 phosphorylation",86a,23820729,"MaxQuant Score",45.7930000,1.0000000,,,,1.1560000181198,9.5090000
EVATLDALKSK,ac,K,101,true,"Quantitative Acetylproteomics",101,29440448,,,,,,,,
FKTGKNR,ub,K,125,false,"Arabidopsis ubiquitination COFRADIC",40,26744219,"MaxQuant Score",89.2960000,1.0000000,,,,0.0060000000521541,0.1650000
