Peptide,PTM,ModifiedAA,ModifiedPosition,PeptideUniqueToGene,ExperimentDesc,ExpID,PubmedID,ScoreType,IdentScore,LocProb,Log2FChange,PQ-val,QuantSig,PEP,MassErrorPPM
QFSPERRPSLDR,ph,S,74,true,"Tissue atlas Arabidopsis - ProteomicsDB",114,32188942,"MaxQuant score",107.7300000,1.0000000,,,,0.00058956100838259,
QFSPERRPSLDR,ph,S,80,true,"Tissue atlas Arabidopsis - ProteomicsDB",114,32188942,"MaxQuant score",107.7300000,1.0000000,,,,0.00058956100838259,
DYAGGLKVGNR,ub,K,125,true,"Arabidopsis ubiquitination COFRADIC",40,26744219,"MaxQuant Score",82.4170000,1.0000000,,,,0.003000000026077,0.3980000
LGNQLSTYLAGSEGNNR,ph,S,246,true,"Tissue atlas Arabidopsis - ProteomicsDB",114,32188942,"MaxQuant score",169.6700000,0.9999990,,,,4.056970019242E-22,
DVGLDIVSDEETNGR,ph,S,259,true,"STN8 phosphoproteome",38,21768351,"MASCOT Score",84.2600000,,,,,,-1.2045300
DVGLDIVSDEETNGR,ph,S,259,true,"Phosphoproteomic analysis of seed maturation",42,22440515,"MASCOT Score",74.0000000,,,,,,-1.1000000
DVGLDIVSDEETNGR,ph,S,259,true,"Tyrosine phosphorylation in Arabidopsis",59,18463617,"MASCOT Score",82.0000000,,,,,,-0.9424444
DVGLDIVSDEETNGR,ph,S,259,true,"Chloroplast kinase substrates",60,19376835,"MASCOT Score",66.6000000,,,,,,-1.4751700
DVGLDIVSDEETNGR,ph,S,259,true,"srk2dei ABA signaling phopshoproteomics",83,23572148,"MASCOT Score",93.0000000,,,,,,-0.0011000
DVGLDIVSDEETNGR,ph,S,259,true,"LAXIC - ABA stress",84a,23660473,XCorr,4.3600000,1.0000000,,,,0.0044302297756076,
DVGLDIVSDEETNGR,ph,S,259,true,"SnRK2 protein kinase substrates",85,23776212,XCorr,4.2521067,1.0000000,,,,8.6142303189263E-5,
DVGLDIVSDEETNGR,ph,S,259,true,"atm and atr DNA damage response",88,25561503,"MASCOT Score",83.0000000,1.0000000,,,,,-0.3000000
DVGLDIVSDEETNGR,ph,S,259,true,"TOR Kinase and ABA Receptor",100,29290610,XCorr,5.5239472,1.0000000,,,,1.5819999532596E-7,
DVGLDIVSDEETNGR,ph,S,259,true,"Lateral root-induction - NAA vs control",106,23328941,"MASCOT Score",39.0000000,,,,,,
DVGLDIVSDEETNGR,ph,S,259,true,"Phospho cell culture sucrose/TOR",109,30833711,,,0.9998780,,,,,
DVGLDIVSDEETNGR,ph,S,259,true,"Col-0 callus - FC Col-0 vs. Col-0 Xray",111a,31410901,,59.4400000,,0.7655301,0.0000000,NO,,1.1093933
DVGLDIVSDEETNGR,ph,S,259,true,"Col-0 X-ray callus - FC Col-0 vs. Col-0 Xray",111b,31410901,,59.4400000,,0.7655301,0.0000000,NO,,1.1093933
DVGLDIVSDEETNGR,ph,S,259,true,"atm callus - FC atm vs. atm Xray",111c,31410901,,59.4400000,,0.4304402,0.0000000,NO,,1.1093933
DVGLDIVSDEETNGR,ph,S,259,true,"atm-3 X-ray callus - FC atm vs. atm Xray",111d,31410901,,59.4400000,,0.4304402,0.0000000,NO,,1.1093933
DVGLDIVSDEETNGR,ph,S,259,true,"Tissue atlas Arabidopsis - ProteomicsDB",114,32188942,"MaxQuant score",335.2400000,1.0000000,,,,0,
DVGLDIVSDEETNGR,ph,S,259,true,"Touch-induced phosphorylation: 40s touch vs untouc",136,30291188,"MASCOT score",107.9900000,,0.7034384,0.3976989,NO,,10.8740408
DVGLDIVSDEETNGR,ph,T,263,true,"srk2dei ABA signaling phopshoproteomics",83,23572148,"MASCOT Score",31.0000000,,,,,,-0.0011000
DVGLDIVSDEETNGR,ph,T,263,true,"Lateral root-induction - NAA vs control",106,23328941,"MASCOT Score",54.0000000,,,,,,
DVGLDIVSDEETNGR,ph,T,263,true,"Tissue atlas Arabidopsis - ProteomicsDB",114,32188942,"MaxQuant score",119.6800000,1.0000000,,,,2.0166999092908E-5,
TACDPHNELQNTSSLSR,ph,S,283,true,"Tissue atlas Arabidopsis - ProteomicsDB",114,32188942,"MaxQuant score",190.6300000,0.9747630,,,,1.4134196960412E-39,
SYSEEESGAWNDEDTINR,ph,S,332,true,"Phospho cell culture sucrose/TOR",109,30833711,,,0.9972170,,,,,
SYSEEESGAWNDEDTINR,ph,S,332,true,"Tissue atlas Arabidopsis - ProteomicsDB",114,32188942,"MaxQuant score",298.9300000,0.9999570,,,,0,
RFSIGTSATDK,ph,S,361,true,"atm and atr DNA damage response",88,25561503,"MASCOT Score",27.0000000,0.9950000,,,,,-2.6800000
RFSIGTSATDK,ph,S,361,true,"Tissue atlas Arabidopsis - ProteomicsDB",114,32188942,"MaxQuant score",201.6500000,0.9998670,,,,2.033850060526E-24,
EFDDVAESEEENPEAANGSPLISLPPPPPFR,ph,S,387,true,"SnRK2 protein kinase substrates",85,23776212,XCorr,4.6380143,1.0000000,,,,0.0020232500974089,
EFDDVAESEEENPEAANGSPLISLPPPPPFR,ph,S,387,true,"TOR Kinase and ABA Receptor",100,29290610,XCorr,4.9590087,1.0000000,,,,7.1380000008503E-6,
EFDDVAESEEENPEAANGSPLISLPPPPPFR,ph,S,398,true,"SnRK2 protein kinase substrates",85,23776212,XCorr,4.6380143,0.9320000,,,,0.0020232500974089,
EFDDVAESEEENPEAANGSPLISLPPPPPFR,ph,S,398,true,"TOR Kinase and ABA Receptor",100,29290610,XCorr,4.9590087,0.8708000,,,,7.1380000008503E-6,
KAYDDDSV,ph,S,436,true,"atm and atr DNA damage response",88,25561503,"MASCOT Score",30.0000000,1.0000000,,,,,0.5600000
KAYDDDSV,ph,S,436,true,"Tissue atlas Arabidopsis - ProteomicsDB",114,32188942,"MaxQuant score",148.1400000,1.0000000,,,,0.0014205400366336,
