Peptide,PTM,ModifiedAA,ModifiedPosition,PeptideUniqueToGene,ExperimentDesc,ExpID,PubmedID,ScoreType,IdentScore,LocProb,Log2FChange,PQ-val,QuantSig,PEP,MassErrorPPM
GCDGSVLINSTSGNAER,ng,N,83,false,"Conserved N-glycosylation",74,22633491,"MaxQuant Score",183.6300000,1.0000000,,,,0,1.6790000
GCDGSVLINSTSGNAER,ng,N,83,false,"ER-associatied N-glycan degradation chilling stres",133,27558752,,,,,,,,
ISNKTEATNNIPPPTSNFTTLQR,ng,N,155,true,"Conserved N-glycosylation",74,22633491,"MaxQuant Score",131.9500000,0.9850000,,,,4.8120001704111E-19,0.4730000
ISNKTEATNNIPPPTSNFTTLQR,ng,N,169,true,"Conserved N-glycosylation",74,22633491,"MaxQuant Score",131.9500000,1.0000000,,,,4.8120001704111E-19,0.4730000
TEATNNIPPPTSNFTTLQR,ng,N,169,true,"Conserved N-glycosylation",74,22633491,"MaxQuant Score",181.2800000,1.0000000,,,,0,1.5860000
LFKNQGLNLK,ac,K,178,true,"Quantitative Acetylproteomics",101,29440448,,,,,,,,
LYNFSTTVKQDPSLDSQYAANLK,ng,N,210,true,"Conserved N-glycosylation",74,22633491,"MaxQuant Score",129.6900000,1.0000000,,,,9.6289996136494E-19,0.2490000
LYNFSTTVKQDPSLDSQYAANLK,ng,N,210,true,"N-Glycopeptide Profiling in Arabidopsis Infloresce",132,27067053,"MOWSE score",24.2000000,,,,,0.0049000000581145,
SLNDNSTILEMDPGSSR,ng,N,240,true,"Conserved N-glycosylation",74,22633491,"MaxQuant Score",163.7700000,0.9680000,,,,5.0940001775136E-39,-1.2870000
VINDLVNGSEK,ng,N,290,true,"Conserved N-glycosylation",74,22633491,"MaxQuant Score",104.7200000,1.0000000,,,,4.8819998482941E-5,0.6380000
AFAKSMEK,ac,K,302,true,"Quantitative Acetylproteomics",101,29440448,,,,,,,,
