Peptide,PTM,ModifiedAA,ModifiedPosition,PeptideUniqueToGene,ExperimentDesc,ExpID,PubmedID,ScoreType,IdentScore,LocProb,Log2FChange,PQ-val,QuantSig,PEP,MassErrorPPM
AASFSVPSMIMEEEGR,nt,A,2,true,"Arg/N-end rule seed, prt6 vs. Wt",99,29168982,"MASCOT Score",50.3500000,,,,,0.0021480000577867,-3.4503520
AASFSVPSMIMEEEGR,nt,A,2,true,"FtsH12 N-terminome: WT / FtsH12 knockdown miRNA",118,33216923,"MaxQuant score",171.3600000,,3.8558900,0.0000087,YES,5.3000001251403E-27,
AASFSVPSMIMEE,nt,A,2,true,"Arg/N-end rule seed, prt6 vs. Wt",99,29168982,"MASCOT Score",28.4500000,,,,,0.0036599999293685,-8.8565255
AASFSVPSMIME,nt,A,2,true,"Arg/N-end rule seed, prt6 vs. Wt",99,29168982,"MASCOT Score",38.8400000,,,,,0.00030859999242239,0.9209910
AASFSVPSMIMEEEGR,nta,A,2,true,"Arg/N-end rule seed, prt6 vs. Wt",99,29168982,"MASCOT Score",50.3500000,,,,,0.0021480000577867,-3.4503520
AASFSVPSMIMEE,nta,A,2,true,"Arg/N-end rule seed, prt6 vs. Wt",99,29168982,"MASCOT Score",28.4500000,,,,,0.0036599999293685,-8.8565255
AASFSVPSMIME,nta,A,2,true,"Arg/N-end rule seed, prt6 vs. Wt",99,29168982,"MASCOT Score",38.8400000,,,,,0.00030859999242239,0.9209910
ASFSVPSMIMEEEGR,nt,A,3,true,"FtsH12 N-terminome: WT / FtsH12 knockdown miRNA",118,33216923,"MaxQuant score",76.1430000,,-0.7132045,0.0366499,YES,7.9500001447741E-5,
IMEEEGR,nt,I,11,true,"Arg/N-end rule seed, prt6 vs. Wt",99,29168982,"MASCOT Score",29.6800000,,2.2968794,0.0020460,YES,0.16169999539852,-0.6901809
AQQYHDR,nt,A,140,true,"Arg/N-end rule seed, prt6 vs. Wt",99,29168982,"MASCOT Score",29.0000000,,-1.1802643,0.0599502,NO,0.15549999475479,-0.8713526
AVSEHINR,nt,A,223,true,"Arg/N-end rule seed, prt6 vs. Wt",99,29168982,"MASCOT Score",41.5900000,,1.0919821,0.0015703,YES,0.089239999651909,-0.4934518
GTETVLVAR,nt,G,242,true,"FtsH12 N-terminome: WT / FtsH12 knockdown miRNA",118,33216923,"MaxQuant score",101.2900000,,0.6719029,0.3020748,NO,1.250000021078E-17,
TDAVAATLIQSNIDAR,nt,T,251,true,"FtsH12 N-terminome: WT / FtsH12 knockdown miRNA",118,33216923,"MaxQuant score",74.1730000,,-0.2981057,0.1074197,NO,0.0034755999222398,
DAVAATLIQSNIDAR,nt,D,252,true,"FtsH12 N-terminome: WT / FtsH12 knockdown miRNA",118,33216923,"MaxQuant score",118.7100000,,3.6345601,0.0000039,YES,3.4899999263871E-6,
LIQSNIDAR,nt,L,258,true,"Metacaspase9 substrates - 35S:MC9 / mc9",51b,23964026,"MASCOT Score",56.0000000,,1.0581264,,NO,,-0.6348530
GPALQSIE,nt,G,298,true,"Arg/N-end rule seed, prt6 vs. Wt",99,29168982,"MASCOT Score",45.5000000,,0.0891363,0.6171676,NO,0.054370000958443,-0.5176285
SAGLMTFSE,nt,S,311,true,"Arg/N-end rule seed, prt6 vs. Wt",99,29168982,"MASCOT Score",47.9900000,,0.2371067,0.2558033,NO,0.0013299999991432,-0.2919036
CLSNEQGR,nt,C,351,true,"Arg/N-end rule seed, prt6 vs. Wt",99,29168982,"MASCOT Score",25.9600000,,0.7192749,0.0934659,NO,0.11299999803305,-1.8956659
LAGFHADALVVDTFAKDYAR,nt,L,473,true,"FtsH12 N-terminome: WT / FtsH12 knockdown miRNA",118,33216923,"MaxQuant score",67.0320000,,0.2908157,0.1380662,NO,0.0065705999732018,
GFHADALVVDTFAKDYAR,nt,G,475,true,"FtsH12 N-terminome: WT / FtsH12 knockdown miRNA",118,33216923,"MaxQuant score",65.0380000,,-0.2533953,0.2125633,NO,0.014271999709308,
SGANYYDR,nt,S,520,true,"Arg/N-end rule seed, prt6 vs. Wt",99,29168982,"MASCOT Score",48.6500000,,0.2803435,0.0309775,NO,0.032129999250174,-1.1568070
