Peptide,PTM,ModifiedAA,ModifiedPosition,PeptideUniqueToGene,ExperimentDesc,ExpID,PubmedID,ScoreType,IdentScore,LocProb,Log2FChange,PQ-val,QuantSig,PEP,MassErrorPPM
VLVPFPCECQPGDFLGHNFSYSVR,ng,N,102,true,"Conserved N-glycosylation",74,22633491,"MaxQuant Score",229.5800000,1.0000000,,,,0,0.6880000
VAISNYANLTTMESLQAR,ng,N,123,true,"Conserved N-glycosylation",74,22633491,"MaxQuant Score",141.8900000,0.9990000,,,,2.3120000491242E-24,-0.9920000
VAISNYANLTTMESLQAR,ng,N,123,true,"N-linked Glycan Micro-heterogeneity Arabidopsis",134,29237727,,,,,,,,
VAISNYANLTTMESLQAR,ng,N,123,true,"UDP-GlcNAc transporter glycopeptide analysis",135,30224661,,,,,,,1.4633462957751E-15,-0.4000000
NPFPATNIPLSATLNVLVNCSCGDESVSK,ng,N,152,true,"ER-associatied N-glycan degradation chilling stres",133,27558752,,,,,,,,
SKGDSFSSSIPLSTK,ph,S,262,true,"Tissue atlas Arabidopsis - ProteomicsDB",114,32188942,"MaxQuant score",56.7480000,0.7959100,,,,0.00083492801059037,
SKGDSFSSSIPLSTK,ph,S,266,true,"Tissue atlas Arabidopsis - ProteomicsDB",114,32188942,"MaxQuant score",266.2400000,0.9999990,,,,0,
GDSFSSSIPLSTK,ph,S,266,true,"TOR Kinase and ABA Receptor",100,29290610,XCorr,3.2858853,0.7670000,,,,0.00014049999299459,
SKGDSFSSSIPLSTK,ph,S,268,true,"Tissue atlas Arabidopsis - ProteomicsDB",114,32188942,"MaxQuant score",169.4500000,0.9390620,,,,7.8678503007487E-26,
SKGDSFSSSIPLSTK,ph,S,270,true,"atm and atr DNA damage response",88,25561503,"MASCOT Score",34.0000000,1.0000000,,,,,-2.3900000
SKGDSFSSSIPLSTK,ph,S,270,true,"Tissue atlas Arabidopsis - ProteomicsDB",114,32188942,"MaxQuant score",258.6800000,0.9914030,,,,0,
SKGDSFSSSIPLSTK,ph,S,274,true,"Tissue atlas Arabidopsis - ProteomicsDB",114,32188942,"MaxQuant score",122.2100000,0.9469000,,,,4.9992099775409E-6,
ADHASSTSLQSGGLGGAGVSPGIAAISVDK,ph,S,287,true,"Phosphorylation Early Elicitor Signaling",23,17317660,,,,,,,,
ADHASSTSLQSGGLGGAGVSPGIAAISVDK,ph,S,287,true,"Tissue atlas Arabidopsis - ProteomicsDB",114,32188942,"MaxQuant score",130.8800000,0.9778840,,,,0,
ADHASSTSLQSGGLGGAGVSPGIAAISVDK,ph,S,296,true,"Tissue atlas Arabidopsis - ProteomicsDB",114,32188942,"MaxQuant score",210.7000000,1.0000000,,,,0,
ATDNFNLSFK,ph,S,325,true,"Tissue atlas Arabidopsis - ProteomicsDB",114,32188942,"MaxQuant score",151.6800000,1.0000000,,,,8.9410701775705E-7,
SANILIDQKFR,ub,K,452,true,"Ubiquitination Membrane Proteins",120,33585938,,,,,,,,
LTEVGGSATR,ph,S,471,true,"Tissue atlas Arabidopsis - ProteomicsDB",114,32188942,"MaxQuant score",115.3400000,0.7576360,,,,0.00018519599689171,
LTEVGGSATR,ph,T,473,true,"Tissue atlas Arabidopsis - ProteomicsDB",114,32188942,"MaxQuant score",116.5400000,0.7767860,,,,0.0004877700121142,
