Peptide,PTM,ModifiedAA,ModifiedPosition,PeptideUniqueToGene,ExperimentDesc,ExpID,PubmedID,ScoreType,IdentScore,LocProb,Log2FChange,PQ-val,QuantSig,PEP,MassErrorPPM
TTQDVIVNDQNDQKQCSNDVIFR,nt,T,2,true,"Arg/N-end rule pathway Roots",80,25728785,"MASCOT Score",44.6200000,,,,,1.3539999599743E-5,
TTQDVIVNDQNDQKQCSNDVIFR,nta,T,2,true,"Arg/N-end rule pathway Roots",80,25728785,"MASCOT Score",49.6900000,,,,,5.1960000746476E-8,
TTQDVIVNDQNDQKQCSNDVIFR,nta,T,2,true,"HUNTER N-terminome: legumain, GluC and trypsin",119,31951383,"MaxQuant score",103.5800000,,,,,,
TTQDVIVNDQNDQK,nta,T,2,true,"Characterization plant N-terminal acetylation",6,22223895,"MASCOT Score",71.3900000,,,,,,
TTQDVIVNDQNDQK,ph,T,2,true,"Lateral root-induction - NAA vs control",106,23328941,"MASCOT Score",27.0000000,,,,,,
ASAAKLIVTQSRYVDK,ph,S,134,true,"SIRK1 phosphorylation",86a,23820729,"MaxQuant Score",113.1400000,1.0000000,,,,0.28000000119209,7.2310000
ASAAKLIVTQSRYVDK,ph,S,134,true,"SIRK1 exp - sirk1 mutant vs WT",86b,23820729,,,,1.5243817,,NO,,
ASAAKLIVTQSRYVDK,ph,S,134,true,"SIRK1 exp - 35S:SIRK1 vs WT",86c,23820729,,,,-0.5843520,,NO,,
ASAAKLIVTQSRYVDK,ph,Y,145,true,"SIRK1 phosphorylation",86a,23820729,"MaxQuant Score",113.1400000,0.9980000,,,,0.28000000119209,7.2310000
ASAAKLIVTQSRYVDK,ph,Y,145,true,"SIRK1 exp - sirk1 mutant vs WT",86b,23820729,,,,1.5243817,,NO,,
ASAAKLIVTQSRYVDK,ph,Y,145,true,"SIRK1 exp - 35S:SIRK1 vs WT",86c,23820729,,,,-0.5843520,,NO,,
SLLIGHPE,nt,S,468,true,"N-terminal ChaFRADIC",92,26010716,"MASCOT Score",39.3300000,,,,,0.0016189999878407,
