Peptide,PTM,ModifiedAA,ModifiedPosition,PeptideUniqueToGene,ExperimentDesc,ExpID,PubmedID,ScoreType,IdentScore,LocProb,Log2FChange,PQ-val,QuantSig,PEP,MassErrorPPM
MKPIQSPSGVASPMKNR,nta,M,1,true,"Arg/N-end rule pathway Roots",80,25728785,"MASCOT Score",41.8600000,,,,,7.7769997005817E-5,
MKPIQSPSGVASPMKNR,nta,M,1,true,"N-terminal ChaFRADIC",92,26010716,"MASCOT Score",36.0200000,,,,,9.07499997993E-5,
MKPIQSPSGVASPMKNR,nta,M,1,true,"Arabidopsis translation initiation landscape - NTA",167a,35069635,,,,,,,,
MKPIQSPSGVASPMKN,nta,M,1,true,"HUNTER N-terminome: legumain, GluC and trypsin",119,31951383,"MaxQuant score",85.4690000,,,,,,
MKPIQSPSGVASPM,nta,M,1,true,"Arg/N-end rule seed, prt6 vs. Wt",99,29168982,"MASCOT Score",43.8500000,,0.3416540,0.1467037,NO,0.051330000162125,1.7440285
MKPIQSPSGV,nta,M,1,true,"N-term acetylation drought responses",5,26184543,,,,,,,,
MKPIQSPSG,nta,M,1,true,"N-terminal ChaFRADIC",92,26010716,"MASCOT Score",29.5900000,,,,,0.075269997119904,
MKPIQSPSGVASPMK,ph,S,6,true,"Tissue atlas Arabidopsis - ProteomicsDB",114,32188942,"MaxQuant score",153.1800000,0.9956850,,,,4.1548300910854E-10,
MKPIQSPSGVASPMK,ph,S,8,true,"Tissue atlas Arabidopsis - ProteomicsDB",114,32188942,"MaxQuant score",91.6530000,0.9251010,,,,1.7335300071863E-5,
MKPIQSPSGVASPMK,ph,S,12,true,"Large-scale phosphorylation discovery",44,23111157,XCorr,3.5590000,,,,,,
MKPIQSPSGVASPMK,ph,S,12,true,"atm and atr DNA damage response",88,25561503,"MASCOT Score",49.0000000,1.0000000,,,,,-0.3400000
MKPIQSPSGVASPMK,ph,S,12,true,"Tissue atlas Arabidopsis - ProteomicsDB",114,32188942,"MaxQuant score",263.1500000,1.0000000,,,,0,
RPDLSLPLPHR,ph,S,25,true,"Tissue atlas Arabidopsis - ProteomicsDB",114,32188942,"MaxQuant score",94.0900000,1.0000000,,,,7.5198600825388E-5,
KRPDLSLPLPHRDVALAVPLPLPPPSSSSSAPASSSAISTNISAAK,fuc,S,49,true,"SPINDLY O-fucosylation",162,36739885,,,,,,,-0.11999999731779,
DVALAVPLPLPPPSSSSSAPASSSAISTNISAAK,fuc,S,49,true,"SPINDLY O-fucosylation",162,36739885,,,,,,,0.20000000298023,
VIHTPTSRPFALK,ph,T,90,true,"Tissue atlas Arabidopsis - ProteomicsDB",114,32188942,"MaxQuant score",111.9100000,0.9963210,,,,5.3563599067274E-5,
VIYGNHEDTVRR,ph,T,108,true,"Tissue atlas Arabidopsis - ProteomicsDB",114,32188942,"MaxQuant score",62.8610000,0.9999300,,,,0.0024590101093054,
