Peptide,PTM,ModifiedAA,ModifiedPosition,PeptideUniqueToGene,ExperimentDesc,ExpID,PubmedID,ScoreType,IdentScore,LocProb,Log2FChange,PQ-val,QuantSig,PEP,MassErrorPPM
MDDLHGR,nta,M,1,true,"Arg/N-end rule pathway Roots",80,25728785,"MASCOT Score",30.8800000,,,,,0.019729999825358,
MDDLHGR,nta,M,1,true,"Arg/N-end rule seed, prt6 vs. Wt",99,29168982,"MASCOT Score",52.3000000,,,,,0.18430000543594,-1.1555062
EVPHTLPTTLGSPHQNNR,ph,S,121,true,"atm and atr DNA damage response",88,25561503,"MASCOT Score",61.0000000,1.0000000,,,,,-0.6200000
EVPHTLPTTLGSPHQNNR,ph,S,121,true,"Tissue atlas Arabidopsis - ProteomicsDB",114,32188942,"MaxQuant score",241.6500000,0.9999970,,,,0,
VLGLSGTPQR,ph,T,134,true,"Tissue atlas Arabidopsis - ProteomicsDB",114,32188942,"MaxQuant score",119.5500000,0.9846380,,,,0.0004238770052325,
VLGLSGTPQRLSVPQR,ph,S,139,true,"Tissue atlas Arabidopsis - ProteomicsDB",114,32188942,"MaxQuant score",133.2400000,0.9673570,,,,1.7376299510374E-8,
GLSGTPQRLSVPQR,ph,S,139,true,"Tissue atlas Arabidopsis - ProteomicsDB",114,32188942,"MaxQuant score",125.4500000,0.9998400,,,,9.7408801593701E-6,
VPPPQTPQHLSLNK,ph,T,267,true,"atm and atr DNA damage response",88,25561503,"MASCOT Score",51.0000000,1.0000000,,,,,0.0700000
VPPPQTPQHLSLNK,ph,T,267,true,"Tissue atlas Arabidopsis - ProteomicsDB",114,32188942,"MaxQuant score",128.4400000,0.9999880,,,,3.3323100069538E-5,
NEDANLEADQMMEVTGDISNTQ,ph,T,296,true,"atm and atr DNA damage response",88,25561503,"MASCOT Score",28.0000000,0.9170000,,,,,-1.3900000
