Peptide,PTM,ModifiedAA,ModifiedPosition,PeptideUniqueToGene,ExperimentDesc,ExpID,PubmedID,ScoreType,IdentScore,LocProb,Log2FChange,PQ-val,QuantSig,PEP,MassErrorPPM
SCQGKAQNQQE,nt,S,53,true,"Arg/N-end rule seed, prt6 vs. Wt",99,29168982,"MASCOT Score",22.9500000,,0.3815737,0.0397195,NO,0.00011690000246745,-0.9870450
GKAQNQQEERPQLSLDDLVTSNR,nt,G,56,true,"HUNTER N-terminome: legumain, GluC and trypsin",119,31951383,"MaxQuant score",83.8710000,,,,,,
QQEERPQLSLDDLVTSN,nt,Q,61,true,"HUNTER N-terminome: legumain, GluC and trypsin",119,31951383,"MaxQuant score",117.0700000,,,,,,
DSLSNCLSETNLLATVPGLK,sno,C,93,true,"hot5-4 / wildtype, FAT-switch S-nitrosoproteome",169,37277371,,,,,,,,
DSLSNCLSETNLLATVPGLK,so,C,93,true,"S-sulfenylation site detection using YAP1C",110,32714340,,,,,,,,
CSVFPIEFVVR,so,C,182,true,"S-sulfenylation site detection using YAP1C",110,32714340,,,,,,,,
NYCGNELSDGLVK,ox,C,215,true,"SPEAR - 50 mM H2O2 / mock",138b,34619326,,,,-0.7281545,0.0281391,YES,,
NYCGNELSDGLVK,sno,C,215,true,"Site-specific nitrosomeproteomic id - gsnor1-3",90a,25699590,XCorr,2.3260348,,,,,0.00029530000756495,-5.8540184
NYCGNELSDGLVK,sno,C,215,true,"Site-specific nitrosomeproteomic id - gsnor1-3",90b,25699590,XCorr,2.2300000,,,,,0.028659999370575,-6.5100000
NYCGNELSDGLVK,so,C,215,true,"S-sulfenylation site detection using YAP1C",110,32714340,,,,,,,,
SSDGSILLIDEIHTPDSSR,ph,T,311,true,"Tissue atlas Arabidopsis - ProteomicsDB",114,32188942,"MaxQuant score",187.7300000,0.9976570,,,,2.3168199779891E-36,
