Peptide,PTM,ModifiedAA,ModifiedPosition,PeptideUniqueToGene,ExperimentDesc,ExpID,PubmedID,ScoreType,IdentScore,LocProb,Log2FChange,PQ-val,QuantSig,PEP,MassErrorPPM
SGATTASSGDHNNLR,nt,S,2,true,"Arg/N-end rule seed, prt6 vs. Wt",99,29168982,"MASCOT Score",66.5700000,,,,,0.0052800001576543,-3.4648021
SGATTASSGDHNNLRLPTPTLDAE,nta,S,2,true,"HUNTER N-terminome: legumain, GluC and trypsin",119,31951383,"MaxQuant score",151.8200000,,,,,,
SGATTASSGDHNNLRLPTPTLDAE,nta,S,2,true,"Arabidopsis translation initiation landscape - NTA",167a,35069635,,,,,,,,
SGATTASSGDHNNLR,nta,S,2,true,"Arg/N-end rule pathway Roots",80,25728785,"MASCOT Score",73.6900000,,,,,2.773999949568E-5,
SGATTASSGDHNNLR,nta,S,2,true,"Arg/N-end rule seed, prt6 vs. Wt",99,29168982,"MASCOT Score",66.5700000,,,,,0.0052800001576543,-3.4648021
SGATTASSGDHNNLR,ph,S,2,true,"atm and atr DNA damage response",88,25561503,"MASCOT Score",64.0000000,0.9940000,,,,,-0.5000000
SGATTASSGDHNNLR,ph,S,2,true,"Tissue atlas Arabidopsis - ProteomicsDB",114,32188942,"MaxQuant score",156.9600000,0.9993300,,,,8.8924099203927E-13,
SGATTASSGDHNNLR,ph,S,8,true,"Tissue atlas Arabidopsis - ProteomicsDB",114,32188942,"MaxQuant score",125.3300000,0.8674390,,,,7.4718298037624E-7,
SGATTASSGDHNNLR,ph,S,9,true,"atm and atr DNA damage response",88,25561503,"MASCOT Score",76.0000000,0.9970000,,,,,-0.4200000
SGATTASSGDHNNLR,ph,S,9,true,"Tissue atlas Arabidopsis - ProteomicsDB",114,32188942,"MaxQuant score",152.8800000,0.9912990,,,,7.023530090855E-10,
DAYSMACLHVAK,so,C,87,true,"Arabidopsis S-sulfenylation chemoproteomics",108,31578252,"pFind PSM Score",0.0565158,,1.2658200,,,,0.8744802
MTKSLEEASGDFK,ph,T,137,true,"Phosphorylation in N starvation",63,22060019,"MASCOT Score",20.0000000,,,,,,-6.3363200
SLEEASGDFKGER,ph,S,144,true,"Tissue atlas Arabidopsis - ProteomicsDB",114,32188942,"MaxQuant score",117.2000000,1.0000000,,,,0.00014241499593481,
