Peptide,PTM,ModifiedAA,ModifiedPosition,PeptideUniqueToGene,ExperimentDesc,ExpID,PubmedID,ScoreType,IdentScore,LocProb,Log2FChange,PQ-val,QuantSig,PEP,MassErrorPPM
MESILAR,nta,M,1,true,"Arg/N-end rule seed, prt6 vs. Wt",99,29168982,"MASCOT Score",54.8000000,,,,,0.17409999668598,-0.4710788
GPSSSQSPTASAK,ph,S,107,true,"atm and atr DNA damage response",88,25561503,"MASCOT Score",76.0000000,0.9900000,,,,,-0.4000000
GPSSSQSPTASAK,ph,S,107,true,"Tissue atlas Arabidopsis - ProteomicsDB",114,32188942,"MaxQuant score",269.8700000,0.9998910,,,,0,
WTAGASHFSLALETSPNSTQLQSPR,ph,S,571,true,"Tissue atlas Arabidopsis - ProteomicsDB",114,32188942,"MaxQuant score",182.0700000,1.0000000,,,,0,
DELQHLTFLCK,so,C,991,true,"Arabidopsis S-sulfenylation chemoproteomics",108,31578252,"pFind PSM Score",0.0072685,,,,,,-1.0774630
AGSPKSSPFAASLDSMR,ph,S,1044,true,"atm and atr DNA damage response",88,25561503,"MASCOT Score",27.0000000,1.0000000,,,,,-0.2000000
AGSPKSSPFAASLDSMR,ph,S,1044,true,"Tissue atlas Arabidopsis - ProteomicsDB",114,32188942,"MaxQuant score",96.4870000,0.9999780,,,,1.3995500012243E-5,
AGSPKSSPFAASLDSMR,ph,S,1048,true,"atm and atr DNA damage response",88,25561503,"MASCOT Score",27.0000000,0.9230000,,,,,-0.2000000
AGSPKSSPFAASLDSMR,ph,S,1048,true,"Tissue atlas Arabidopsis - ProteomicsDB",114,32188942,"MaxQuant score",142.1200000,0.9847970,,,,2.4214100449171E-6,
SSPFAASLDSMR,ph,S,1056,true,"Tissue atlas Arabidopsis - ProteomicsDB",114,32188942,"MaxQuant score",126.6300000,0.9977960,,,,3.6757501220563E-5,
