Peptide,PTM,ModifiedAA,ModifiedPosition,PeptideUniqueToGene,ExperimentDesc,ExpID,PubmedID,ScoreType,IdentScore,LocProb,Log2FChange,PQ-val,QuantSig,PEP,MassErrorPPM
HECCISFDTPR,so,C,25,true,"Arabidopsis S-sulfenylation chemoproteomics",108,31578252,"pFind PSM Score",0.2729970,,1.8518500,,,,-1.2604470
HECCISFDTPR,ph,T,31,true,"Col-0 callus - FC Col-0 vs. Col-0 Xray",111a,31410901,,27.0600000,,0.8009670,0.0000000,NO,,0.7624407
HECCISFDTPR,ph,T,31,true,"Col-0 X-ray callus - FC Col-0 vs. Col-0 Xray",111b,31410901,,27.0600000,,0.8009670,0.0000000,NO,,0.7624407
HECCISFDTPR,ph,T,31,true,"atm callus - FC atm vs. atm Xray",111c,31410901,,27.0600000,,1.2687101,0.0000000,NO,,0.7624407
HECCISFDTPR,ph,T,31,true,"atm-3 X-ray callus - FC atm vs. atm Xray",111d,31410901,,27.0600000,,1.2687101,0.0000000,NO,,0.7624407
HECCISFDTPR,ph,T,31,true,"Tissue atlas Arabidopsis - ProteomicsDB",114,32188942,"MaxQuant score",273.7200000,1.0000000,,,,0,
AIGVDGGFDNNEPE,nt,A,88,true,"Arg/N-end rule seed, prt6 vs. Wt",99,29168982,"MASCOT Score",57.7500000,,-0.3681398,0.5978002,NO,0.00055459997383878,-1.5488467
IGVDGGFDNNEPE,nt,I,89,true,"Arg/N-end rule seed, prt6 vs. Wt",99,29168982,"MASCOT Score",74.4400000,,-0.0820408,0.8261312,NO,1.1339999446136E-6,-2.5315743
KEQVAAWTAEK,ub,K,144,true,"upl3 mutant / wildtype",168,35926874,"MaxQuant score",174.9000000,1.0000000,0.4874863,0.5382600,NO,8.1040001098653E-11,0.4987600
QQDALDFFLHLVGKVER,ub,K,426,true,"upl3 mutant / wildtype",168,35926874,"MaxQuant score",60.0620000,1.0000000,,,,0.0001989549928112,2.0468000
SFKFGIEEK,ub,K,444,true,"upl3 mutant / wildtype",168,35926874,"MaxQuant score",87.2580000,1.0000000,-0.2986727,0.1578440,NO,0.005817640107125,0.2579400
ILCPSGK,ox,C,453,true,"OxiTRAQ Arabidopsis - 5 mM H2O2 versus control",47,24376095,,,,0.5931197,0.0058405,YES,,
ILCPSGK,sno,C,453,true,"hot5-4 / wildtype, FAT-switch S-nitrosoproteome",169,37277371,,,,,,,,
ILCPSGK,so,C,453,true,"S-sulfenylation site detection using YAP1C",110,32714340,,,,,,,,
REDCILSLNIPLHEATNK,so,C,466,true,"Arabidopsis S-sulfenylation chemoproteomics",108,31578252,"pFind PSM Score",0.0008313,,1.2946900,,,,-1.2708328
ATDWVFNNPNASVSDMDVSSSNSAQTPAQSGLPDGGGK,ph,S,716,true,"TOR Kinase and ABA Receptor",100,29290610,XCorr,3.8947153,0.8331000,,,,0.00042140000732616,
