Peptide,PTM,ModifiedAA,ModifiedPosition,PeptideUniqueToGene,ExperimentDesc,ExpID,PubmedID,ScoreType,IdentScore,LocProb,Log2FChange,PQ-val,QuantSig,PEP,MassErrorPPM
GNCFAK,myr,G,2,true,"N-Terminal Myristoylated Proteins",102,29453228,,,,,,,,
NHGLMKPQQNGNTTR,ph,T,20,true,"Tissue atlas Arabidopsis - ProteomicsDB",114,32188942,"MaxQuant score",92.1330000,0.9510490,,,,3.3767999411793E-5,
SVEVGVTNQDPPSYTPQAR,nt,S,23,true,"Metacaspase9 substrates - Col-0 / mc9",51a,23964026,"MASCOT Score",72.0000000,,1.1576195,,NO,,-2.4550924
SVEVGVTNQDPPSYTPQAR,nt,S,23,true,"Arg/N-end rule seed, prt6 vs. Wt",99,29168982,"MASCOT Score",53.3800000,,-0.8521385,0.2706045,NO,0.00035940000088885,-1.2464833
SVEVGVTNQDPPSYTPQAR,ph,S,23,true,"Tissue atlas Arabidopsis - ProteomicsDB",114,32188942,"MaxQuant score",142.8400000,1.0000000,,,,2.3652300653352E-20,
SVEVGVTNQDPPSYTPQAR,ph,T,37,true,"Phosphorylation Early Elicitor Signaling",23,17317660,,,,,,,,
SVEVGVTNQDPPSYTPQAR,ph,T,37,true,"Large-scale phosphorylation discovery",44,23111157,XCorr,4.1430000,,,,,,
SVEVGVTNQDPPSYTPQAR,ph,T,37,true,"TOR Kinase and ABA Receptor",100,29290610,XCorr,5.6555428,0.9993000,,,,1.1250000042651E-8,
SVEVGVTNQDPPSYTPQAR,ph,T,37,true,"Tissue atlas Arabidopsis - ProteomicsDB",114,32188942,"MaxQuant score",289.2400000,0.9999580,,,,0,
TTQQPEKPGSVNSQPPPWR,ph,S,51,true,"Large-scale phosphorylation discovery",44,23111157,XCorr,3.0300000,,,,,,
TTQQPEKPGSVNSQPPPWR,ph,S,51,true,"PAMP-triggered phosphorylation",48,24601666,"MASCOT Score",20.4100000,,,,,,
TTQQPEKPGSVNSQPPPWR,ph,S,51,true,"TOR Kinase and ABA Receptor",100,29290610,XCorr,4.8449368,0.9999000,,,,9.8550003713171E-7,
TTQQPEKPGSVNSQPPPWR,ph,S,51,true,"Tissue atlas Arabidopsis - ProteomicsDB",114,32188942,"MaxQuant score",234.7200000,0.9999000,,,,0,
TTQQPEKPGSVNSQPPPWR,ph,S,54,true,"SnRK2 protein kinase substrates",85,23776212,XCorr,2.1407919,0.8510000,,,,0.0065123699605465,
TTQQPEKPGSVNSQPPPWR,ph,S,54,true,"Tissue atlas Arabidopsis - ProteomicsDB",114,32188942,"MaxQuant score",187.5700000,0.9999840,,,,2.6761899420263E-37,
AAAAAPGLSPK,ph,S,69,true,"Phosphorylation Early Elicitor Signaling",23,17317660,,,,,,,,
AAAAAPGLSPK,ph,S,69,true,"STN8 phosphoproteome",38,21768351,"MASCOT Score",56.1000000,,,,,,0.1020940
AAAAAPGLSPK,ph,S,69,true,"Large-scale phosphorylation discovery",44,23111157,XCorr,2.9550000,,,,,,
AAAAAPGLSPK,ph,S,69,true,"Chloroplast kinase substrates",60,19376835,"MASCOT Score",52.8500000,,,,,,0.1020940
AAAAAPGLSPK,ph,S,69,true,"atm and atr DNA damage response",88,25561503,"MASCOT Score",57.0000000,1.0000000,,,,,-2.1400000
AAAAAPGLSPK,ph,S,69,true,"TOR Kinase and ABA Receptor",100,29290610,XCorr,2.6147139,1.0000000,,,,0.00057859998196363,
AAAAAPGLSPK,ph,S,69,true,"Lateral root-induction - NAA vs control",106,23328941,"MASCOT Score",26.0000000,,,,,,
AAAAAPGLSPK,ph,S,69,true,"Phospho cell culture sucrose/TOR",109,30833711,,,1.0000000,,,,,
AAAAAPGLSPK,ph,S,69,true,"Tissue atlas Arabidopsis - ProteomicsDB",114,32188942,"MaxQuant score",142.1200000,1.0000000,,,,1.2474400534757E-7,
AAAAAPGLSPKTTTK,ub,K,71,true,"Ubiquitination Membrane Proteins",120,33585938,,,,,,,,
SNSILENAFEDVK,ph,S,78,true,"Phosphorylation Early Elicitor Signaling",23,17317660,,,,,,,,
SNSILENAFEDVK,ph,S,78,true,"LAXIC - ABA stress",84a,23660473,XCorr,4.1000000,0.9990000,,,,0.0082979695871472,
SNSILENAFEDVK,ph,S,78,true,"SnRK2 protein kinase substrates",85,23776212,XCorr,3.7129154,0.9990000,,,,0.0025214299093932,
SNSILENAFEDVK,ph,S,78,true,"Tissue atlas Arabidopsis - ProteomicsDB",114,32188942,"MaxQuant score",249.7300000,0.9999880,,,,0,
GQFGVTYLCTENSTGKK,ub,K,115,true,"Ubiquitination Membrane Proteins",120,33585938,,,,,,,,
GQFGVTYLCTENSTGKK,ub,K,115,true,"upl3 mutant / wildtype",168,35926874,"MaxQuant score",82.3490000,1.0000000,0.2448871,,,1.2943800356879E-5,1.8887000
AAASVCR,so,C,196,false,"Arabidopsis S-sulfenylation chemoproteomics",108,31578252,"pFind PSM Score",0.0032599,,0.9275800,,,,-1.0652964
DIVGSAYYVAPEVLR,ph,S,255,false,"Plasmamembrane phosphorylation",20,15308754,,,,,,,,
RISAADVLQHPWLR,ph,S,339,true,"Tissue atlas Arabidopsis - ProteomicsDB",114,32188942,"MaxQuant score",119.3800000,1.0000000,,,,7.5285302045813E-6,
EGGEASDKPIDSAVLSR,ph,S,356,false,"Tissue atlas Arabidopsis - ProteomicsDB",114,32188942,"MaxQuant score",78.9750000,0.9984880,,,,7.9631099652033E-5,
LGSKLTEAEVK,ub,K,427,false,"Ubiquitination Membrane Proteins",120,33585938,,,,,,,,
LESNENLYK,ph,S,465,true,"atm and atr DNA damage response",88,25561503,"MASCOT Score",41.0000000,1.0000000,,,,,-2.0600000
EVLSDVDSDNDGR,ph,S,509,true,"Plasmamembrane phosphorylation",20,15308754,,,,,,,,
EVLSDVDSDNDGR,ph,S,509,true,"Plasmembrane Ph Immune Responses",25,17651370,,,,,,,,
EVLSDVDSDNDGR,ph,S,509,true,"Phytohormone-responsive phosphoproteins",34,20374526,"MASCOT Score",62.0000000,,,,,,8.1670800
EVLSDVDSDNDGR,ph,S,509,true,"Tyrosine phosphorylation in Arabidopsis",59,18463617,"MASCOT Score",99.0000000,,,,,,-0.9335971
EVLSDVDSDNDGR,ph,S,509,true,"atm and atr DNA damage response",88,25561503,"MASCOT Score",67.0000000,1.0000000,,,,,-0.2600000
EVLSDVDSDNDGR,ph,S,509,true,"Tissue atlas Arabidopsis - ProteomicsDB",114,32188942,"MaxQuant score",169.5800000,1.0000000,,,,5.1682702070105E-15,
EVLSDVDSDNDGR,ph,S,513,true,"Large-scale phosphorylation discovery",44,23111157,XCorr,4.1400000,,,,,,
EVLSDVDSDNDGR,ph,S,513,true,"atm and atr DNA damage response",88,25561503,"MASCOT Score",61.0000000,1.0000000,,,,,0.3000000
EVLSDVDSDNDGR,ph,S,513,true,"Tissue atlas Arabidopsis - ProteomicsDB",114,32188942,"MaxQuant score",108.7100000,0.9996710,,,,0.00014282600022852,
