Peptide,PTM,ModifiedAA,ModifiedPosition,PeptideUniqueToGene,ExperimentDesc,ExpID,PubmedID,ScoreType,IdentScore,LocProb,Log2FChange,PQ-val,QuantSig,PEP,MassErrorPPM
TTTQSAMRMVE,nt,T,2,true,"Arg/N-end rule seed, prt6 vs. Wt",99,29168982,"MASCOT Score",30.4600000,,,,,0.010520000010729,-1.4936637
TTTQSAMR,nt,T,2,true,"Arg/N-end rule seed, prt6 vs. Wt",99,29168982,"MASCOT Score",52.1900000,,,,,0.18330000340939,-0.2100863
TTTQSAMRMVEG,nta,T,2,true,"Arabidopsis translation initiation landscape - NTA",167a,35069635,,,,,,,,
TTTQSAMRMVE,nta,T,2,true,"Arg/N-end rule seed, prt6 vs. Wt",99,29168982,"MASCOT Score",30.4600000,,,,,0.010520000010729,-1.4936637
TTTQSAMR,nta,T,2,true,"Arg/N-end rule seed, prt6 vs. Wt",99,29168982,"MASCOT Score",52.1900000,,,,,0.18330000340939,-0.2100863
LDSGDQTGKFPSR,ph,S,49,true,"Tissue atlas Arabidopsis - ProteomicsDB",114,32188942,"MaxQuant score",196.5200000,1.0000000,,,,2.6511999906525E-30,
SESAPPSMEGSFAALR,ph,S,60,true,"SnRK2 protein kinase substrates",85,23776212,XCorr,2.5525672,0.9480000,,,,9.1968601623194E-8,
SESAPPSMEGSFAALR,ph,S,60,true,"Phospho cell culture sucrose/TOR",109,30833711,,,0.8368470,,,,,
SESAPPSMEGSFAALR,ph,S,60,true,"Col-0 callus - FC Col-0 vs. Col-0 Xray",111a,31410901,,43.4100000,,0.4346290,0.0000000,NO,,0.5404620
SESAPPSMEGSFAALR,ph,S,60,true,"Col-0 X-ray callus - FC Col-0 vs. Col-0 Xray",111b,31410901,,43.4100000,,0.4346290,0.0000000,NO,,0.5404620
SESAPPSMEGSFAALR,ph,S,60,true,"atm callus - FC atm vs. atm Xray",111c,31410901,,43.4100000,,1.5813267,0.0000000,NO,,0.5404620
SESAPPSMEGSFAALR,ph,S,60,true,"atm-3 X-ray callus - FC atm vs. atm Xray",111d,31410901,,43.4100000,,1.5813267,0.0000000,NO,,0.5404620
SESAPPSMEGSFAALR,ph,S,60,true,"Tissue atlas Arabidopsis - ProteomicsDB",114,32188942,"MaxQuant score",72.0750000,0.8314170,,,,1.4538200048264E-5,
SESAPPSMEGSFAALR,ph,S,62,true,"PAMP-triggered phosphorylation",48,24601666,"MASCOT Score",51.0600000,,,,,,
SESAPPSMEGSFAALR,ph,S,62,true,"srk2dei ABA signaling phopshoproteomics",83,23572148,"MASCOT Score",76.0000000,,,,,,0.0006000
SESAPPSMEGSFAALR,ph,S,62,true,"LAXIC - ABA stress",84a,23660473,XCorr,3.2400000,0.8230000,,,,0.00053806201322004,
SESAPPSMEGSFAALR,ph,S,62,true,"atm and atr DNA damage response",88,25561503,"MASCOT Score",88.0000000,0.9960000,,,,,-0.1300000
SESAPPSMEGSFAALR,ph,S,62,true,"Lateral root-induction - NAA vs control",106,23328941,"MASCOT Score",58.0000000,,,,,,
SESAPPSMEGSFAALR,ph,S,62,true,"Phospho cell culture sucrose/TOR",109,30833711,,,0.9526470,,,,,
SESAPPSMEGSFAALR,ph,S,62,true,"Col-0 callus - FC Col-0 vs. Col-0 Xray",111a,31410901,,75.8300000,,0.1063458,0.0000000,NO,,1.1318168
SESAPPSMEGSFAALR,ph,S,62,true,"Col-0 X-ray callus - FC Col-0 vs. Col-0 Xray",111b,31410901,,75.8300000,,0.1063458,0.0000000,NO,,1.1318168
SESAPPSMEGSFAALR,ph,S,62,true,"atm callus - FC atm vs. atm Xray",111c,31410901,,75.8300000,,0.4667215,0.0000000,NO,,1.1318168
SESAPPSMEGSFAALR,ph,S,62,true,"atm-3 X-ray callus - FC atm vs. atm Xray",111d,31410901,,75.8300000,,0.4667215,0.0000000,NO,,1.1318168
SESAPPSMEGSFAALR,ph,S,62,true,"Tissue atlas Arabidopsis - ProteomicsDB",114,32188942,"MaxQuant score",294.9700000,0.9999840,,,,0,
QQEGSSSEVLSR,ph,S,84,true,"Tissue atlas Arabidopsis - ProteomicsDB",114,32188942,"MaxQuant score",79.6390000,0.8726630,,,,0.0014921899419278,
QQEGSSSEVLSR,ph,S,85,true,"Tissue atlas Arabidopsis - ProteomicsDB",114,32188942,"MaxQuant score",134.2100000,0.9750480,,,,2.7438200049801E-5,
AIENYDSEEEIR,ph,S,98,true,"STN8 phosphoproteome",38,21768351,"MASCOT Score",61.9900000,,,,,,-1.6119900
AIENYDSEEEIR,ph,S,98,true,"Large-scale phosphorylation discovery",44,23111157,XCorr,4.1330000,,,,,,
AIENYDSEEEIR,ph,S,98,true,"atm and atr DNA damage response",88,25561503,"MASCOT Score",61.0000000,0.9970000,,,,,-0.1700000
AIENYDSEEEIR,ph,S,98,true,"Lateral root-induction - NAA vs control",106,23328941,"MASCOT Score",33.0000000,,,,,,
AIENYDSEEEIR,ph,S,98,true,"Col-0 callus - FC Col-0 vs. Col-0 Xray",111a,31410901,,49.7000000,,0.2041502,0.0000000,NO,,1.3061086
AIENYDSEEEIR,ph,S,98,true,"Col-0 X-ray callus - FC Col-0 vs. Col-0 Xray",111b,31410901,,49.7000000,,0.2041502,0.0000000,NO,,1.3061086
AIENYDSEEEIR,ph,S,98,true,"atm callus - FC atm vs. atm Xray",111c,31410901,,49.7000000,,-0.0375279,0.0000000,NO,,1.3061086
AIENYDSEEEIR,ph,S,98,true,"atm-3 X-ray callus - FC atm vs. atm Xray",111d,31410901,,49.7000000,,-0.0375279,0.0000000,NO,,1.3061086
AIENYDSEEEIR,ph,S,98,true,"Tissue atlas Arabidopsis - ProteomicsDB",114,32188942,"MaxQuant score",205.8600000,1.0000000,,,,7.9668499562008E-31,
HFGDNNQSPTTSWDNMGIR,ph,S,144,true,"Tissue atlas Arabidopsis - ProteomicsDB",114,32188942,"MaxQuant score",182.3100000,0.9987860,,,,3.741330043334E-36,
STHREEPEDEASSGEQQSY,nt,S,166,true,"Arabidopsis translation initiation landscape - NT",167b,35069635,,,,,,,,
TALSTHREEPEDEASSGEQQSYASLAGR,ph,S,166,true,"Tissue atlas Arabidopsis - ProteomicsDB",114,32188942,"MaxQuant score",234.8300000,0.9337020,,,,0,
TALSTHREEPEDEASSGEQQSYASLAGR,ph,S,177,true,"TOR Kinase and ABA Receptor",100,29290610,XCorr,3.7453287,0.8195000,,,,0.0011769999982789,
EEPEDEASSGEQQSYASLAGR,ph,S,177,true,"Tissue atlas Arabidopsis - ProteomicsDB",114,32188942,"MaxQuant score",266.7800000,0.9999990,,,,0,
EEPEDEASSGEQQSYASLAGR,ph,S,178,true,"Tissue atlas Arabidopsis - ProteomicsDB",114,32188942,"MaxQuant score",173.1800000,0.9999980,,,,2.4172799393068E-36,
TALSTHREEPEDEASSGEQQSYASLAGR,ph,S,183,true,"TOR Kinase and ABA Receptor",100,29290610,XCorr,5.4169111,0.7759000,,,,0.00015890000213403,
TALSTHREEPEDEASSGEQQSYASLAGR,ph,Y,184,true,"TOR Kinase and ABA Receptor",100,29290610,XCorr,5.4169111,0.7759000,,,,0.00015890000213403,
SIADMIQRPHSAGNR,ph,S,193,true,"Tissue atlas Arabidopsis - ProteomicsDB",114,32188942,"MaxQuant score",115.8500000,1.0000000,,,,2.5222300337191E-6,
SIADMIQRPHSAGNRPIAQDIHAISSDTSSEHAR,ph,S,203,true,"Tissue atlas Arabidopsis - ProteomicsDB",114,32188942,"MaxQuant score",263.6300000,1.0000000,,,,0,
RLPESDINSVNLLR,ph,S,235,true,"atm and atr DNA damage response",88,25561503,"MASCOT Score",26.0000000,1.0000000,,,,,-0.8800000
LPESDINSVNLLR,ph,S,235,true,"Tissue atlas Arabidopsis - ProteomicsDB",114,32188942,"MaxQuant score",252.3600000,1.0000000,,,,0,
QASHEDNNLSVFGASPPSSVASR,fuc,S,279,true,"SPINDLY O-fucosylation",162,36739885,,,,,,,0.93000000715256,
QASHEDNNLSVFGASPPSSVASR,ph,S,291,true,"srk2dei ABA signaling phopshoproteomics",83,23572148,"MASCOT Score",41.0000000,,,,,,-0.0007000
QASHEDNNLSVFGASPPSSVASR,ph,S,291,true,"atm and atr DNA damage response",88,25561503,"MASCOT Score",49.0000000,0.9930000,,,,,-0.3000000
QASHEDNNLSVFGASPPSSVASR,ph,S,291,true,"Brassinosteroid-Regulated Phosphorylation Dynamics",94,26187819,"MaxQuant Score",97.1240000,0.9970000,,,,0.00011600000289036,0.2580000
QASHEDNNLSVFGASPPSSVASR,ph,S,291,true,"TOR Kinase and ABA Receptor",100,29290610,XCorr,5.5218778,0.9968000,,,,2.7230000796408E-6,
QASHEDNNLSVFGASPPSSVASR,ph,S,291,true,"Lateral root-induction - NAA vs control",106,23328941,"MASCOT Score",32.0000000,,,,,,
QASHEDNNLSVFGASPPSSVASR,ph,S,291,true,"Col-0 callus - FC Col-0 vs. Col-0 Xray",111a,31410901,,62.8200000,,0.7147198,0.0000000,NO,,1.1684425
QASHEDNNLSVFGASPPSSVASR,ph,S,291,true,"Col-0 X-ray callus - FC Col-0 vs. Col-0 Xray",111b,31410901,,62.8200000,,0.7147198,0.0000000,NO,,1.1684425
QASHEDNNLSVFGASPPSSVASR,ph,S,291,true,"atm callus - FC atm vs. atm Xray",111c,31410901,,62.8200000,,0.8620034,0.0000000,NO,,1.1684425
QASHEDNNLSVFGASPPSSVASR,ph,S,291,true,"atm-3 X-ray callus - FC atm vs. atm Xray",111d,31410901,,62.8200000,,0.8620034,0.0000000,NO,,1.1684425
QASHEDNNLSVFGASPPSSVASR,ph,S,291,true,"Tissue atlas Arabidopsis - ProteomicsDB",114,32188942,"MaxQuant score",376.2900000,1.0000000,,,,0,
RMPPQYTPSSYQVQASSPQQMSYPR,ph,S,329,true,"Tissue atlas Arabidopsis - ProteomicsDB",114,32188942,"MaxQuant score",108.0100000,0.9149110,,,,9.0300102551437E-22,
IGGTQDMMQSLPK,og,T,341,true,"O-GlcNac Inflorescence Tissue",81,28154133,"MASCOT Score",44.2000000,,,,,,0.9700000
IGGTQDMMQSLPK,ph,S,347,true,"Tissue atlas Arabidopsis - ProteomicsDB",114,32188942,"MaxQuant score",40.2780000,0.9904770,,,,0.015892600640655,
DQQAVGYMANHEPLNSPLSPGYGLQSPR,ph,S,469,true,"Tissue atlas Arabidopsis - ProteomicsDB",114,32188942,"MaxQuant score",180.1600000,0.9985860,,,,0,
DQQAVGYMANHEPLNSPLSPGYGLQSPR,ph,S,472,true,"TOR Kinase and ABA Receptor",100,29290610,XCorr,5.5949626,0.9987000,,,,6.4230000873522E-8,
DQQAVGYMANHEPLNSPLSPGYGLQSPR,ph,S,472,true,"Tissue atlas Arabidopsis - ProteomicsDB",114,32188942,"MaxQuant score",200.3300000,0.9934960,,,,0,
DQQAVGYMANHEPLNSPLSPGYGLQSPR,ph,S,479,true,"Lateral root-induction - NAA vs control",106,23328941,"MASCOT Score",31.0000000,,,,,,
DQQAVGYMANHEPLNSPLSPGYGLQSPR,ph,S,479,true,"Tissue atlas Arabidopsis - ProteomicsDB",114,32188942,"MaxQuant score",211.4500000,0.9999700,,,,0,
HMGNYFAVPPGVR,ph,Y,486,true,"Chloroplast kinase substrates",60,19376835,"MASCOT Score",36.6600000,,,,,,-0.8285630
VMPQYPGSPLASPVMPSSPVGGMMSHFGR,ph,S,502,true,"Brassinosteroid-Regulated Phosphorylation Dynamics",94,26187819,"MaxQuant Score",95.6660000,0.9950000,,,,9.3010003183736E-6,1.1740000
VMPQYPGSPLASPVMPSSPVGGMMSHFGR,ph,S,502,true,"TOR Kinase and ABA Receptor",100,29290610,XCorr,4.8552508,0.9995000,,,,1.0710000424297E-5,
VMPQYPGSPLASPVMPSSPVGGMMSHFGR,ph,S,502,true,"Tissue atlas Arabidopsis - ProteomicsDB",114,32188942,"MaxQuant score",94.0590000,0.9665660,,,,1.2353599664834E-16,
VMPQYPGSPLASPVMPSSPVGGMMSHFGR,ph,S,506,true,"Brassinosteroid-Regulated Phosphorylation Dynamics",94,26187819,"MaxQuant Score",95.6660000,0.9990000,,,,9.3010003183736E-6,1.9150000
VMPQYPGSPLASPVMPSSPVGGMMSHFGR,ph,S,506,true,"TOR Kinase and ABA Receptor",100,29290610,XCorr,4.8552508,1.0000000,,,,1.0710000424297E-5,
VMPQYPGSPLASPVMPSSPVGGMMSHFGR,ph,S,511,true,"Brassinosteroid-Regulated Phosphorylation Dynamics",94,26187819,"MaxQuant Score",95.6660000,0.9630000,,,,9.3010003183736E-6,1.1740000
VMPQYPGSPLASPVMPSSPVGGMMSHFGR,ph,S,511,true,"Tissue atlas Arabidopsis - ProteomicsDB",114,32188942,"MaxQuant score",203.7100000,0.8484290,,,,0,
VMPQYPGSPLASPVMPSSPVGGMMSHFGR,ph,S,512,true,"Brassinosteroid-Regulated Phosphorylation Dynamics",94,26187819,"MaxQuant Score",95.6660000,0.8750000,,,,9.3010003183736E-6,1.9150000
VMPQYPGSPLASPVMPSSPVGGMMSHFGR,ph,S,512,true,"Tissue atlas Arabidopsis - ProteomicsDB",114,32188942,"MaxQuant score",135.8800000,0.8334890,,,,0,
NTGIYPGGWQGNRGGASSIVDDLK,me1,R,549,true,"Arabidopsis protein methylome",123,31809900,"MaxQuant Score",49.0760000,1.0000000,,,,0.00023189300554805,0.5801600
GGASSIVDDLKR,ph,S,554,true,"Tissue atlas Arabidopsis - ProteomicsDB",114,32188942,"MaxQuant score",198.5700000,0.9998430,,,,6.1322600435802E-25,
GGASSIVDDLKR,ac,K,560,true,"Quantitative Acetylproteomics",101,29440448,,,,,,,,
RHSFLDELK,ph,S,563,true,"Tissue atlas Arabidopsis - ProteomicsDB",114,32188942,"MaxQuant score",71.1760000,1.0000000,,,,0.0016225799918175,
HSFLDELKSPNAR,ph,S,570,true,"atm and atr DNA damage response",88,25561503,"MASCOT Score",32.0000000,1.0000000,,,,,-0.9900000
HSFLDELKSPNAR,ph,S,570,true,"Tissue atlas Arabidopsis - ProteomicsDB",114,32188942,"MaxQuant score",224.6700000,1.0000000,,,,0,
LEHCSDEEK,sno,C,605,true,"Site-specific nitrosomeproteomic id - gsnor1-3",90a,25699590,XCorr,2.8716011,,,,,0.00083199999062344,-6.4051212
LEHCSDEEK,sno,C,605,true,"Site-specific nitrosomeproteomic id - gsnor1-3",90b,25699590,XCorr,2.9000000,,,,,0.072719998657703,-6.9600000
FEQLFGEESEVSEEGTEG,ph,S,904,true,"srk2dei ABA signaling phopshoproteomics",83,23572148,"MASCOT Score",47.0000000,,,,,,-0.0012000
FEQLFGEESEVSEEGTEG,ph,S,904,true,"Brassinosteroid-Regulated Phosphorylation Dynamics",94,26187819,"MaxQuant Score",145.3300000,1.0000000,,,,1.5610000199964E-27,-3.5790000
FEQLFGEESEVSEEGTEG,ph,S,907,true,"srk2dei ABA signaling phopshoproteomics",83,23572148,"MASCOT Score",47.0000000,,,,,,-0.0012000
FEQLFGEESEVSEEGTEG,ph,S,907,true,"atm and atr DNA damage response",88,25561503,"MASCOT Score",48.0000000,1.0000000,,,,,-0.7500000
FEQLFGEESEVSEEGTEG,ph,S,907,true,"Brassinosteroid-Regulated Phosphorylation Dynamics",94,26187819,"MaxQuant Score",145.3300000,1.0000000,,,,1.5610000199964E-27,-3.5790000
FEQLFGEESEVSEEGTEG,ph,T,911,true,"srk2dei ABA signaling phopshoproteomics",83,23572148,"MASCOT Score",47.0000000,,,,,,-0.0012000
FEQLFGEESEVSEEGTEG,ph,T,911,true,"atm and atr DNA damage response",88,25561503,"MASCOT Score",48.0000000,1.0000000,,,,,-0.7500000
FEQLFGEESEVSEEGTEG,ph,T,911,true,"Brassinosteroid-Regulated Phosphorylation Dynamics",94,26187819,"MaxQuant Score",145.3300000,1.0000000,,,,1.5610000199964E-27,-3.5790000
