Peptide,PTM,ModifiedAA,ModifiedPosition,PeptideUniqueToGene,ExperimentDesc,ExpID,PubmedID,ScoreType,IdentScore,LocProb,Log2FChange,PQ-val,QuantSig,PEP,MassErrorPPM
VTPFMQSLKSLPADYR,ph,S,11,true,"Tissue atlas Arabidopsis - ProteomicsDB",114,32188942,"MaxQuant score",55.7630000,0.8367670,,,,0.00065710098715499,
SLPADYRFDGSPVSDR,ph,S,14,true,"Chloroplast kinase substrates",60,19376835,"MASCOT Score",39.3200000,,,,,,-1.1092800
SLPADYR,ph,S,14,true,"Tissue atlas Arabidopsis - ProteomicsDB",114,32188942,"MaxQuant score",107.9800000,1.0000000,,,,4.0757399233371E-8,
FDGSPVSDR,ph,S,24,true,"atm and atr DNA damage response",88,25561503,"MASCOT Score",32.0000000,0.9360000,,,,,0.2100000
FDGSPVSDR,ph,S,24,true,"Tissue atlas Arabidopsis - ProteomicsDB",114,32188942,"MaxQuant score",115.0000000,0.9999910,,,,0.00040327198803425,
RWSDTSAYAR,ph,S,104,true,"Tissue atlas Arabidopsis - ProteomicsDB",114,32188942,"MaxQuant score",98.1670000,0.9958650,,,,0.00036812399048358,
ILSTSGEESVISLPEGK,ph,S,135,true,"Tissue atlas Arabidopsis - ProteomicsDB",114,32188942,"MaxQuant score",187.0000000,0.9814420,,,,3.1413499138154E-30,
MKSMEEIWQK,me2,K,1000,false,"Arabidopsis protein methylome",123,31809900,"MaxQuant Score",176.7800000,1.0000000,,,,0,-0.4416900
SLQSSLSIAK,ph,S,1015,false,"Tissue atlas Arabidopsis - ProteomicsDB",114,32188942,"MaxQuant score",81.5250000,0.7933880,,,,0.0015592300333083,
SLQSSLSIAKK,ph,S,1016,false,"Tissue atlas Arabidopsis - ProteomicsDB",114,32188942,"MaxQuant score",232.7800000,0.9791000,,,,2.1131580842018E-42,
SLQSSLSIAK,ph,S,1016,false,"Tyrosine phosphorylation in Arabidopsis",59,18463617,"MASCOT Score",33.0000000,,,,,,-0.2696514
SLQSSLSIAK,ph,S,1016,false,"srk2dei ABA signaling phopshoproteomics",83,23572148,"MASCOT Score",55.0000000,,,,,,-0.0001000
SLQSSLSIAKK,ph,S,1018,false,"Arabidopsis root NAA phosphoproteome",18a,27643528,"MaxQuant Score",82.0690000,0.9550000,,,,3.4570000480016E-6,0.4350000
SLQSSLSIAKK,ph,S,1018,false,"srk2dei ABA signaling phopshoproteomics",83,23572148,"MASCOT Score",23.0000000,,,,,,-0.0004000
SLQSSLSIAKK,ph,S,1018,false,"atm and atr DNA damage response",88,25561503,"MASCOT Score",36.0000000,0.9830000,,,,,-1.4900000
SLQSSLSIAKK,ph,S,1018,false,"Tissue atlas Arabidopsis - ProteomicsDB",114,32188942,"MaxQuant score",198.3700000,0.9989320,,,,6.6071299581857E-19,
SLQSSLSIAK,ph,S,1018,false,"Tyrosine phosphorylation in Arabidopsis",59,18463617,"MASCOT Score",42.0000000,,,,,,-0.8988386
SLQSSLSIAK,ph,S,1018,false,"srk2dei ABA signaling phopshoproteomics",83,23572148,"MASCOT Score",54.0000000,,,,,,0.0002000
SLQSSLSIAK,ph,S,1018,false,"SnRK2 protein kinase substrates",85,23776212,XCorr,2.2737830,0.9920000,,,,0.043383698910475,
SLQSSLSIAK,ph,S,1018,false,"atm and atr DNA damage response",88,25561503,"MASCOT Score",65.0000000,0.9970000,,,,,-0.5000000
SLQSSLSIAK,ph,S,1018,false,"TOR Kinase and ABA Receptor",100,29290610,XCorr,3.5373068,0.9997000,,,,0.00015330000314862,
SLAVEDSAR,ph,S,1029,true,"STN8 phosphoproteome",38,21768351,"MASCOT Score",60.4800000,,,,,,0.3671710
SLAVEDSAR,ph,S,1029,true,"atm and atr DNA damage response",88,25561503,"MASCOT Score",63.0000000,1.0000000,,,,,-0.7600000
SLAVEDSAR,ph,S,1029,true,"Tissue atlas Arabidopsis - ProteomicsDB",114,32188942,"MaxQuant score",137.8900000,1.0000000,,,,9.3996401119512E-5,
NSDASVNASDATDWDSSSNQFR,ph,S,1033,true,"Tissue atlas Arabidopsis - ProteomicsDB",114,32188942,"MaxQuant score",402.3600000,1.0000000,,,,0,
LQPMSAGLSVIGR,ph,S,1072,true,"Tissue atlas Arabidopsis - ProteomicsDB",114,32188942,"MaxQuant score",53.3000000,0.9183660,,,,0.018214099109173,
SGQVEANLDPDR,ph,S,1100,true,"atm and atr DNA damage response",88,25561503,"MASCOT Score",52.0000000,1.0000000,,,,,0.2900000
SGQVEANLDPDR,ph,S,1100,true,"Tissue atlas Arabidopsis - ProteomicsDB",114,32188942,"MaxQuant score",107.1100000,1.0000000,,,,7.8395598393399E-5,
