Peptide,PTM,ModifiedAA,ModifiedPosition,PeptideUniqueToGene,ExperimentDesc,ExpID,PubmedID,ScoreType,IdentScore,LocProb,Log2FChange,PQ-val,QuantSig,PEP,MassErrorPPM
SDLQTPLVRP,nt,S,2,true,"N-term acetylation drought responses",5,26184543,,,,,,,,
SDLQTPLVR,nt,S,2,true,"Arg/N-end rule seed, prt6 vs. Wt",99,29168982,"MASCOT Score",50.6800000,,-0.0145607,0.9428656,NO,0.10679999738932,-0.1741074
SDLQTPLVR,nt,S,2,true,"FtsH12 N-terminome: WT / FtsH12 knockdown miRNA",118,33216923,"MaxQuant score",108.3700000,,,,,3.6199998851212E-20,
SDLQTPLVR,nt,S,2,true,"HUNTER N-terminome: legumain, GluC and trypsin",119,31951383,"MaxQuant score",80.4550000,,,,,,
SDLQTPLVRP,nta,S,2,true,"N-term acetylation drought responses",5,26184543,,,,,,,,
SDLQTPLVR,nta,S,2,true,"Arg/N-end rule seed, prt6 vs. Wt",99,29168982,"MASCOT Score",50.6800000,,,,,0.10679999738932,-0.1741074
SDLQTPLVR,nta,S,2,true,"FtsH12 N-terminome: WT / FtsH12 knockdown miRNA",118,33216923,"MaxQuant score",171.2600000,,,,,0,
SDLQTPLVR,nta,S,2,true,"HUNTER N-terminome: legumain, GluC and trypsin",119,31951383,"MaxQuant score",83.2650000,,,,,,
SDLQTPLVRPK,ph,S,2,true,"Arabidopsis root NAA phosphoproteome",18a,27643528,"MaxQuant Score",71.5580000,1.0000000,,,,1.1000000085915E-5,-0.1880000
SDLQTPLVRPK,ph,S,2,true,"STN8 phosphoproteome",38,21768351,"MASCOT Score",49.2200000,,,,,,-1.0334800
SDLQTPLVRPK,ph,S,2,true,"Phosphoproteome ethylene-regulated time response",46,24043427,"MASCOT Score",34.7600000,,,,,,-3.9831000
SDLQTPLVRPK,ph,S,2,true,"Tyrosine phosphorylation in Arabidopsis",59,18463617,"MASCOT Score",38.0000000,,,,,,-0.7503681
SDLQTPLVRPK,ph,S,2,true,"Chloroplast kinase substrates",60,19376835,"MASCOT Score",44.6000000,,,,,,-0.4940320
SDLQTPLVRPK,ph,S,2,true,"atm and atr DNA damage response",88,25561503,"MASCOT Score",60.0000000,1.0000000,,,,,-1.1900000
SDLQTPLVRPK,ph,S,2,true,"Phospho cell culture sucrose/TOR",109,30833711,,,1.0000000,,,,,
SDLQTPLVRPK,ph,S,2,true,"Col-0 callus - FC Col-0 vs. Col-0 Xray",111a,31410901,,24.3500000,,1.7048842,0.0295161,YES,,0.0660712
SDLQTPLVRPK,ph,S,2,true,"Col-0 X-ray callus - FC Col-0 vs. Col-0 Xray",111b,31410901,,24.3500000,,1.7048842,0.0295161,YES,,0.0660712
SDLQTPLVRPK,ph,S,2,true,"atm callus - FC atm vs. atm Xray",111c,31410901,,24.3500000,,3.9852504,0.2638566,NO,,0.0660712
SDLQTPLVRPK,ph,S,2,true,"atm-3 X-ray callus - FC atm vs. atm Xray",111d,31410901,,24.3500000,,3.9852504,0.2638566,NO,,0.0660712
SDLQTPLVRPK,ph,S,2,true,"Tissue atlas Arabidopsis - ProteomicsDB",114,32188942,"MaxQuant score",231.6600000,1.0000000,,,,6.6029183638985E-42,
SDLQTPLVR,ph,S,2,true,"atm and atr DNA damage response",88,25561503,"MASCOT Score",57.0000000,1.0000000,,,,,-0.1200000
SDLQTPLVRPK,ph,T,6,true,"Tissue atlas Arabidopsis - ProteomicsDB",114,32188942,"MaxQuant score",119.2100000,1.0000000,,,,0.00013190000026952,
SDLQTPLVRPKR,ac,K,12,true,"Quantitative Acetylproteomics",101,29440448,,,,,,,,
DASKDGLVCTAR,ox,C,86,true,"OxiTRAQ Arabidopsis - 5 mM H2O2 versus control",47,24376095,,,,-0.0579440,0.5140146,NO,,
DGLVCTAR,ox,C,86,true,"OxiTRAQ Arabidopsis - 5 mM H2O2 versus control",47,24376095,,,,-0.1243221,0.3446137,NO,,
DGLVCTAR,sno,C,86,true,"hot5-4 / wildtype, FAT-switch S-nitrosoproteome",169,37277371,,,,-0.8697643,0.0025922,YES,,
CLYWEGK,ox,C,342,true,"OxiTRAQ Arabidopsis - 5 mM H2O2 versus control",47,24376095,,,,-0.0594433,0.4439616,NO,,
QGDTEDAQMYTDVGVYYAPGCVLR,nt,Q,446,true,"HUNTER N-terminome: legumain, GluC and trypsin",119,31951383,"MaxQuant score",75.3000000,,,,,,
WLIENHGFQPQYAVSELDEKSFWR,ub,K,504,true,"upl3 mutant / wildtype",168,35926874,"MaxQuant score",117.4000000,1.0000000,0.6834719,,,6.4354899810809E-18,0.9071900
