Peptide,PTM,ModifiedAA,ModifiedPosition,PeptideUniqueToGene,ExperimentDesc,ExpID,PubmedID,ScoreType,IdentScore,LocProb,Log2FChange,PQ-val,QuantSig,PEP,MassErrorPPM
GVYEYGFEKPSAIQQR,nt,G,49,true,"Arabidopsis translation initiation landscape - NT",167b,35069635,,,,,,,,
GVYEYGFEKPSAIQQR,ub,K,57,true,"Arabidopsis ubiquitination COFRADIC",40,26744219,"MaxQuant Score",51.0300000,1.0000000,,,,6.1299999742914E-7,-0.8130000
TSMIALSVCQVVDTSSR,ox,C,94,true,"SPEAR - 50 mM H2O2 / mock",138b,34619326,,,,-0.7729966,0.0195241,YES,,
TSMIALSVCQVVDTSSR,so,C,94,true,"S-sulfenylation site detection using YAP1C",110,32714340,,,,,,,,
EVQALILSPTR,ph,S,110,true,"Tissue atlas Arabidopsis - ProteomicsDB",114,32188942,"MaxQuant score",129.5400000,0.9713650,,,,5.7574698075769E-6,
IGGNSVGE,nt,I,138,true,"Arg/N-end rule seed, prt6 vs. Wt",99,29168982,"MASCOT Score",35.6700000,,-0.3485244,0.0487832,NO,0.047460000962019,-0.4952899
KLEHGVHVVSGTPGR,ph,T,160,true,"Tissue atlas Arabidopsis - ProteomicsDB",114,32188942,"MaxQuant score",133.2400000,0.9999010,,,,1.2824399675537E-7,
LEHGVHVVSGTPGR,ph,T,160,true,"Phospho cell culture sucrose/TOR",109,30833711,,,0.9529650,,,,,
VCDMIK,sno,C,165,true,"hot5-4 / wildtype, FAT-switch S-nitrosoproteome",169,37277371,,,,0.8310510,0.0159145,YES,,
LEHGVHVVSGTPGRVCDMIK,so,C,165,true,"S-sulfenylation site detection using YAP1C",110,32714340,,,,,,,,
LLILDESDEMLSR,ph,S,186,true,"SIRK1 phosphorylation",86a,23820729,"MaxQuant Score",67.9000000,0.9950000,,,,1.1549999713898,4.4650000
LLILDESDEMLSR,ph,S,186,true,"SIRK1 exp - sirk1 mutant vs WT",86b,23820729,,,,-1.1371823,,NO,,
KVDYLSEKMR,ac,K,293,true,"Quantitative Acetylproteomics",101,29440448,,,,,,,,
SMHGDMPQKERDAIMNEF,nt,S,303,true,"Arabidopsis translation initiation landscape - NT",167b,35069635,,,,,,,,
