Peptide,PTM,ModifiedAA,ModifiedPosition,PeptideUniqueToGene,ExperimentDesc,ExpID,PubmedID,ScoreType,IdentScore,LocProb,Log2FChange,PQ-val,QuantSig,PEP,MassErrorPPM
APSAQPLPVSVSDE,nt,A,2,true,"HUNTER N-terminome: legumain, GluC and trypsin",119,31951383,"MaxQuant score",145.9100000,,,,,,
APSAQPLPVSVSD,nt,A,2,true,"HUNTER N-terminome: legumain, GluC and trypsin",119,31951383,"MaxQuant score",128.1700000,,,,,,
YANVKWEELAFK,ub,K,21,true,"upl3 mutant / wildtype",168,35926874,"MaxQuant score",108.5600000,1.0000000,-0.3603048,0.3916200,NO,8.8792497990653E-5,0.9125700
CNHGESFQEGK,sno,C,40,true,"Site-specific nitrosomeproteomic id - gsnor1-3",90a,25699590,XCorr,2.4451394,,,,,0.00035940000088885,-6.3119204
CNHGESFQEGK,sno,C,40,true,"Site-specific nitrosomeproteomic id - gsnor1-3",90b,25699590,XCorr,2.1300000,,,,,0.041039999574423,-0.7400000
YHKDNSGLNLK,ub,K,173,true,"upl3 mutant / wildtype",168,35926874,"MaxQuant score",192.6800000,1.0000000,-0.4739312,0.6542200,NO,2.1124000815981E-17,0.4775100
DNSGLNLKIEDQFR,ph,S,176,true,"Phosphorylation in N starvation",63,22060019,"MASCOT Score",20.0000000,,,,,,4.8130500
KQGFSDILFLDAATGK,ub,K,215,true,"upl3 mutant / wildtype",168,35926874,"MaxQuant score",126.8400000,1.0000000,-0.5166356,0.2292400,NO,2.1864199339916E-8,1.3435000
TGFKTGEETLAAK,ub,K,318,true,"upl3 mutant / wildtype",168,35926874,"MaxQuant score",88.1010000,1.0000000,-1.0350469,0.4023000,NO,1.9358400095371E-5,-0.0610430
