Peptide,PTM,ModifiedAA,ModifiedPosition,PeptideUniqueToGene,ExperimentDesc,ExpID,PubmedID,ScoreType,IdentScore,LocProb,Log2FChange,PQ-val,QuantSig,PEP,MassErrorPPM
SSSGGGGKPTILVTE,nt,S,39,true,"N-terminal ChaFRADIC",92,26010716,"MASCOT Score",22.4700000,,,,,0.032770000398159,
SSSGGGGKPTILVTE,nt,S,39,true,"HUNTER N-terminome: legumain, GluC and trypsin",119,31951383,"MaxQuant score",127.1700000,,,,,,
SSSGGGGKPTILVTE,nta,S,39,true,"N-terminal ChaFRADIC",92,26010716,"MASCOT Score",22.4700000,,,,,0.032770000398159,
SSSGGGGKPTILVTE,nta,S,39,true,"HUNTER N-terminome: legumain, GluC and trypsin",119,31951383,"MaxQuant score",140.7800000,,,,,,
ISLCDALIVR,acy,C,87,false,"Arabidopsis S-acylation atlas - Meristem",163a,35681017,,,,,,,,
ISLCDALIVR,sno,C,87,false,"Site-specific nitrosomeproteomic id - gsnor1-3",90a,25699590,XCorr,3.5161004,,,,,0.0002954000083264,-6.4718257
ISLCDALIVR,so,C,87,false,"S-sulfenylation site detection using YAP1C",110,32714340,,,,,,,,
SVTATPHLGASTME,nt,S,318,true,"N-terminal ChaFRADIC",92,26010716,"MASCOT Score",37.4500000,,,,,0.00012440000136849,
FASALSESGEIK,ph,S,482,true,"srk2dei ABA signaling phopshoproteomics",83,23572148,"MASCOT Score",28.0000000,,,,,,0.0003000
FASALSESGEIK,ph,S,484,true,"atm and atr DNA damage response",88,25561503,"MASCOT Score",73.0000000,0.9440000,,,,,-0.7800000
